program: Orca
programVersion: 5.0.2
elementType: Cl S S P O O O O N C C C C C C C C C C C C H H H H H H H H H H H H H H H
charge: 0
multiplicity: 1
keywords: wb97x-d3
keywords: def2-TZVPP
keywords: def2/J RIJCOSX
keywords: DEFGRID2
keywords: scfconv7
keywords: smallprint printgap noloewdin
keywords: NOSOSCF
formula: C12H15ClNO4PS2
InChI: InChI=1/C12H15ClNO4PS2/c1-3-16-19(20,17-4-2)21-8-14-10-6-5-9(13)7-11(10)18-12(14)15/h5-7H,3-4,8H2,1-2H3
36 atoms
Cl 5.237305 -2.103969 -0.628326
S  -0.706892 0.981761 2.161464
S  -3.16942 -1.2320 2.080127
P  -2.120168 -0.045179 1.01217
O  1.222014 0.737289 -2.099856
O  -1.2946 -0.72094 -0.192232
O  -2.843241 1.1586 0.262893
O  -0.561797 2.112602 -1.928464
N  0.749361 1.543779 -0.099434
C  1.849821 0.722295 0.049929
C  0.008519 2.160258 0.950104
C  2.125083 0.236715 -1.219639
C  0.345142 1.535262 -1.419652
C  2.618328 0.350231 1.131806
C  3.155268 -0.630722 -1.479681
C  3.673011 -0.528813 0.896214
C  3.927818 -1.005889 -0.381433
C  -0.559784 -1.937529 0.000721
C  -4.114125 1.009757 -0.39104
C  -0.351068 -2.58871 -1.344669
C  -4.004941 0.286342 -1.713118
H  0.657086 2.801551 1.549399
H  -0.774412 2.774901 0.513589
H  2.413343 0.701577 2.132902
H  3.357319 -1.003045 -2.473662
H  4.297015 -0.847185 1.718921
H  0.395889 -1.702705 0.477696
H  -1.114853 -2.600124 0.669496
H  -4.806832 0.502772 0.285096
H  -4.467002 2.029728 -0.534292
H  0.179416 -1.933002 -2.033565
H  0.242256 -3.494229 -1.219487
H  -1.300797 -2.867524 -1.799561
H  -3.763571 -0.767587 -1.581155
H  -4.962034 0.343262 -2.232256
H  -3.243695 0.740723 -2.345592
totalener: -2420.14069865 hartree
nucrepener: 2498.96472916 hartree
electener: -4919.10542781 hartree
oneelecener: -8303.30657932 hartree
twoeener: 3384.20115151 hartree
kineticenergy: 2414.02218594 hartree
xcener: -154.016544962593 hartree
chargesum: -0.0000000
charge: -0.069013 -0.137043 -0.361930 0.587725 -0.233850 -0.305265 -0.303886 -0.326663 -0.071281 0.000322 -0.117990 0.158703 0.361732 -0.139025 -0.179744 -0.126388 0.109531 -0.008368 0.000762 -0.239252 -0.216684 0.153633 0.152594 0.123974 0.132402 0.121097 0.100046 0.120789 0.094883 0.094590 0.084294 0.089073 0.092488 0.070635 0.086384 0.100725
qa: -0.0690 -0.1370 -0.3619 0.5877 -0.2339 -0.3053 -0.3039 -0.3267 -0.0713 0.0003 -0.1180 0.1587 0.3617 -0.1390 -0.1797 -0.1264 0.1095 -0.0084 0.0008 -0.2393 -0.2167 0.1536 0.1526 0.1240 0.1324 0.1211 0.1000 0.1208 0.0949 0.0946 0.0843 0.0891 0.0925 0.0706 0.0864 0.1007
va: 1.2327 2.2480 2.1138 5.4470 2.2047 2.0670 2.1245 2.1896 3.1656 3.8487 3.9221 3.8706 4.3656 4.0051 4.0627 4.0493 3.9053 3.8458 3.9098 3.9452 3.8896 0.9839 1.0254 1.0160 1.0153 1.0145 0.9818 1.0200 1.0102 0.9920 1.0077 1.0080 1.0086 1.0186 1.0119 1.0112
dispcorr: -0.023472193 hartree
energy: -2420.164170845903
dipole: -18.50923 19.14529 0.63606 -1.42403 1.69289 0.26885 -7.15167 7.12187 -0.02980
magnitude: 0.69119 au
magnitude: 1.75686 debye
