program: Orca
programVersion: 5.0.2
elementType: Cl S S P O O O O N C C C C C C C C C C C C H H H H H H H H H H H H H H H
charge: 0
multiplicity: 1
keywords: wb97x-d3
keywords: def2-TZVPP
keywords: def2/J RIJCOSX
keywords: DEFGRID2
keywords: scfconv7
keywords: smallprint printgap noloewdin
keywords: NOSOSCF
formula: C12H15ClNO4PS2
InChI: InChI=1/C12H15ClNO4PS2/c1-3-16-19(20,17-4-2)21-8-14-10-6-5-9(13)7-11(10)18-12(14)15/h5-7H,3-4,8H2,1-2H3
36 atoms
Cl 4.871352 -2.152149 -1.064638
S  -0.654295 1.255349 2.135648
S  -3.056995 -1.010638 2.380404
P  -2.074715 0.076077 1.153204
O  0.83946 0.777733 -2.287003
O  -1.272416 -0.699338 -0.00672
O  -2.852898 1.175826 0.307585
O  -0.872531 2.225058 -2.019478
N  0.575763 1.679353 -0.28839
C  1.654832 0.821118 -0.201803
C  -0.054039 2.357736 0.795398
C  1.797642 0.276204 -1.468929
C  0.056158 1.634139 -1.567402
C  2.504075 0.460909 0.822042
C  2.769423 -0.638821 -1.783731
C  3.501515 -0.467335 0.530482
C  3.624817 -1.000985 -0.744518
C  -0.54656 -1.908336 0.256065
C  -4.119449 0.919679 -0.322472
C  -0.467435 -2.704612 -1.023292
C  -3.985521 0.129492 -1.604109
H  0.6517 3.024756 1.293542
H  -0.873883 2.954287 0.403937
H  2.402786 0.858103 1.821889
H  2.867021 -1.055968 -2.775786
H  4.185168 -0.777647 1.307694
H  0.450137 -1.647634 0.621276
H  -1.053241 -2.480268 1.037266
H  -4.777678 0.415843 0.389658
H  -4.529983 1.908274 -0.520244
H  0.004342 -2.135507 -1.823177
H  0.128151 -3.601845 -0.854911
H  -1.457072 -3.014011 -1.357896
H  -4.953458 0.097009 -2.105074
H  -3.267827 0.594819 -2.277955
H  -3.674877 -0.898105 -1.420508
totalener: -2420.14040989 hartree
nucrepener: 2512.65690493 hartree
electener: -4932.79731482 hartree
oneelecener: -8330.67269812 hartree
twoeener: 3397.87538330 hartree
kineticenergy: 2414.02038281 hartree
xcener: -154.016864830882 hartree
chargesum: -0.0000000
charge: -0.068733 -0.139977 -0.360385 0.586624 -0.230892 -0.306508 -0.303677 -0.329856 -0.077468 0.007622 -0.110524 0.181674 0.361337 -0.150856 -0.206099 -0.132311 0.122286 -0.005465 0.004971 -0.241836 -0.222539 0.155482 0.150360 0.124312 0.133294 0.120825 0.101238 0.119340 0.094025 0.095662 0.086417 0.090555 0.091485 0.088150 0.101718 0.069751
qa: -0.0687 -0.1400 -0.3604 0.5866 -0.2309 -0.3065 -0.3037 -0.3299 -0.0775 0.0076 -0.1105 0.1817 0.3613 -0.1509 -0.2061 -0.1323 0.1223 -0.0055 0.0050 -0.2418 -0.2225 0.1555 0.1504 0.1243 0.1333 0.1208 0.1012 0.1193 0.0940 0.0957 0.0864 0.0906 0.0915 0.0881 0.1017 0.0698
va: 1.2330 2.2460 2.1162 5.4482 2.2100 2.0631 2.1262 2.1865 3.1751 3.8337 3.9197 3.8542 4.3692 4.0007 4.0595 4.0475 3.8919 3.8482 3.9047 3.9426 3.8956 0.9826 1.0257 1.0179 1.0155 1.0150 0.9808 1.0210 1.0105 0.9918 1.0041 1.0088 1.0084 1.0126 1.0121 1.0166
dispcorr: -0.023960167 hartree
energy: -2420.164370057167
dipole: -17.60676 18.28353 0.67677 -2.71552 2.87744 0.16193 -5.42495 5.31470 -0.11025
magnitude: 0.70455 au
magnitude: 1.79082 debye
