program: Orca
programVersion: 5.0.2
elementType: Cl S S P O O O O N C C C C C C C C C C C C H H H H H H H H H H H H H H H
charge: 0
multiplicity: 1
keywords: wb97x-d3
keywords: def2-TZVPP
keywords: def2/J RIJCOSX
keywords: DEFGRID2
keywords: scfconv7
keywords: smallprint printgap noloewdin
keywords: NOSOSCF
formula: C12H15ClNO4PS2
InChI: InChI=1/C12H15ClNO4PS2/c1-3-16-19(20,17-4-2)21-8-14-10-6-5-9(13)7-11(10)18-12(14)15/h5-7H,3-4,8H2,1-2H3
36 atoms
Cl 5.052061 -2.092113 0.443051
S  -1.61886 0.895271 -1.105483
S  -1.866419 0.275714 2.267582
P  -2.560738 -0.060656 0.499518
O  2.714206 1.827338 -1.910649
O  -2.561467 -1.586965 0.014239
O  -4.082753 0.33604 0.254526
O  1.089458 3.316431 -2.411776
N  0.888468 1.805618 -0.666551
C  1.699684 0.782652 -0.205347
C  -0.459681 2.070148 -0.297196
C  2.837461 0.829937 -0.997235
C  1.50099 2.425085 -1.738835
C  1.576941 -0.148378 0.803287
C  3.896162 -0.027532 -0.8370
C  2.635733 -1.034946 0.984792
C  3.764363 -0.971254 0.180378
C  -1.365111 -2.373047 0.077456
C  -5.07477 0.203879 1.285514
C  -1.666815 -3.747465 -0.465718
C  -5.415437 -1.235765 1.59463
H  -0.588746 2.002422 0.783841
H  -0.72142 3.071074 -0.629528
H  0.701727 -0.195038 1.438043
H  4.777418 0.023268 -1.460198
H  2.578924 -1.779625 1.765976
H  -0.5782 -1.889569 -0.509443
H  -1.023605 -2.427361 1.114675
H  -4.731697 0.723643 2.182882
H  -5.941897 0.735312 0.897461
H  -2.450421 -4.240307 0.108376
H  -1.977247 -3.70428 -1.508754
H  -0.769957 -4.363723 -0.40769
H  -4.583703 -1.756553 2.067743
H  -6.256718 -1.263109 2.287519
H  -5.699829 -1.780705 0.695528
totalener: -2420.14195414 hartree
nucrepener: 2391.73216628 hartree
electener: -4811.87412042 hartree
oneelecener: -8088.47418115 hartree
twoeener: 3276.60006073 hartree
kineticenergy: 2414.03208914 hartree
xcener: -154.016761554193 hartree
chargesum: -0.0000000
charge: -0.072975 -0.117599 -0.399492 0.613039 -0.230168 -0.304515 -0.311060 -0.327027 -0.089878 0.082209 -0.091801 0.179692 0.365704 -0.235208 -0.171530 -0.117333 0.097213 0.032020 -0.000594 -0.235722 -0.222388 0.145332 0.148750 0.126948 0.131542 0.118847 0.087654 0.090690 0.095323 0.100268 0.085964 0.088718 0.080352 0.078608 0.086625 0.091788
qa: -0.0730 -0.1176 -0.3995 0.6130 -0.2302 -0.3045 -0.3111 -0.3270 -0.0899 0.0822 -0.0918 0.1797 0.3657 -0.2352 -0.1715 -0.1173 0.0972 0.0320 -0.0006 -0.2357 -0.2224 0.1453 0.1487 0.1269 0.1315 0.1188 0.0877 0.0907 0.0953 0.1003 0.0860 0.0887 0.0804 0.0786 0.0866 0.0918
va: 1.2286 2.3033 2.0460 5.4177 2.2371 2.1162 2.1566 2.1929 3.1955 3.8080 3.8964 3.9192 4.3714 3.9301 4.0754 4.0521 3.9128 3.8568 3.9148 3.9846 3.8847 1.0345 1.0146 1.0690 1.0153 1.0152 0.9913 1.0015 1.0070 0.9902 1.0056 1.0056 1.0073 1.0211 1.0114 1.0069
dispcorr: -0.019459664 hartree
energy: -2420.161413808042
dipole: -29.19639 28.18463 -1.01176 -12.69249 11.53207 -1.16042 6.89251 -6.06154 0.83097
magnitude: 1.74950 au
magnitude: 4.44688 debye
