program: Orca
programVersion: 5.0.2
elementType: Cl S S P O O O O N C C C C C C C C C C C C H H H H H H H H H H H H H H H
charge: 0
multiplicity: 1
keywords: wb97x-d3
keywords: def2-TZVPP
keywords: def2/J RIJCOSX
keywords: DEFGRID2
keywords: scfconv7
keywords: smallprint printgap noloewdin
keywords: NOSOSCF
formula: C12H15ClNO4PS2
InChI: InChI=1/C12H15ClNO4PS2/c1-3-16-19(20,17-4-2)21-8-14-10-6-5-9(13)7-11(10)18-12(14)15/h5-7H,3-4,8H2,1-2H3
36 atoms
Cl 5.104209 -1.807247 -1.268187
S  -0.824914 0.341605 2.251609
S  -3.244185 -1.71915 1.293264
P  -2.121408 -0.272624 0.736015
O  1.175824 1.455893 -1.803034
O  -1.210206 -0.561216 -0.560503
O  -2.771332 1.130744 0.35554
O  -0.56229 2.773257 -1.22082
N  0.696104 1.610543 0.347227
C  1.770649 0.749972 0.236879
C  -0.066926 1.85016 1.526072
C  2.047843 0.673783 -1.11945
C  0.314823 2.030121 -0.912862
C  2.520254 0.046019 1.15347
C  3.060364 -0.097116 -1.631601
C  3.557232 -0.743194 0.66189
C  3.813939 -0.810052 -0.699965
C  -0.897223 -1.889906 -1.004285
C  -3.725997 1.244932 -0.716355
C  0.138072 -2.572099 -0.141866
C  -5.126525 1.353071 -0.162047
H  0.568994 2.241414 2.322085
H  -0.834858 2.58653 1.304994
H  2.311094 0.075456 2.21312
H  3.263349 -0.150126 -2.691509
H  4.164656 -1.31528 1.348327
H  -1.814396 -2.481158 -1.04173
H  -0.533021 -1.761142 -2.023138
H  -3.436079 2.136344 -1.270226
H  -3.64464 0.395114 -1.39882
H  1.068517 -2.009083 -0.09836
H  -0.226259 -2.724669 0.8738
H  0.361144 -3.553212 -0.562021
H  -5.40883 0.447403 0.373191
H  -5.219695 2.200379 0.516199
H  -5.832745 1.499288 -0.979957
totalener: -2420.13971796 hartree
nucrepener: 2506.35975781 hartree
electener: -4926.49947577 hartree
oneelecener: -8318.22088066 hartree
twoeener: 3391.72140489 hartree
kineticenergy: 2414.02359206 hartree
xcener: -154.019034485664 hartree
chargesum: -0.0000000
charge: -0.069932 -0.131414 -0.362506 0.595128 -0.230873 -0.320699 -0.316842 -0.330381 -0.079839 0.001724 -0.111451 0.187449 0.360824 -0.145363 -0.177260 -0.123066 0.102872 0.006454 0.020601 -0.210473 -0.215613 0.153562 0.150671 0.120944 0.130707 0.118209 0.106994 0.097009 0.104420 0.079090 0.059224 0.087812 0.094659 0.083494 0.084156 0.079709
qa: -0.0699 -0.1314 -0.3625 0.5951 -0.2309 -0.3207 -0.3168 -0.3304 -0.0798 0.0017 -0.1115 0.1874 0.3608 -0.1454 -0.1773 -0.1231 0.1029 0.0065 0.0206 -0.2105 -0.2156 0.1536 0.1507 0.1209 0.1307 0.1182 0.1070 0.0970 0.1044 0.0791 0.0592 0.0878 0.0947 0.0835 0.0842 0.0797
va: 1.2305 2.2461 2.1019 5.4456 2.2174 2.0604 2.1174 2.1852 3.1677 3.8560 3.9311 3.8834 4.3736 3.9904 4.0764 4.0252 3.9021 3.8557 3.9073 3.9011 3.9329 0.9828 1.0253 1.0179 1.0168 1.0160 1.0171 0.9923 0.9980 1.0008 0.9989 1.0282 1.0175 1.0208 1.0058 1.0099
dispcorr: -0.023621039 hartree
energy: -2420.163339003625
dipole: -19.61593 20.21950 0.60357 0.45237 -0.29609 0.15628 -0.46516 0.51204 0.04688
magnitude: 0.62524 au
magnitude: 1.58922 debye
