program: Orca
programVersion: 5.0.2
elementType: Cl S S P O O O O N C C C C C C C C C C C C H H H H H H H H H H H H H H H
charge: 0
multiplicity: 1
keywords: wb97x-d3
keywords: def2-TZVPP
keywords: def2/J RIJCOSX
keywords: DEFGRID2
keywords: scfconv7
keywords: smallprint printgap noloewdin
keywords: NOSOSCF
formula: C12H15ClNO4PS2
InChI: InChI=1/C12H15ClNO4PS2/c1-3-16-19(20,17-4-2)21-8-14-10-6-5-9(13)7-11(10)18-12(14)15/h5-7H,3-4,8H2,1-2H3
36 atoms
Cl 4.857612 0.517146 2.170203
S  -2.06934 0.532665 -1.49956
S  -0.89161 -2.604312 -0.827528
P  -1.73888 -1.01357 -0.141965
O  1.403369 3.096682 -0.614858
O  -3.21976 -1.198705 0.43663
O  -0.993511 -0.261805 1.04952
O  -0.29765 3.446107 -2.066535
N  0.537865 1.3359 -1.631738
C  1.525647 0.862492 -0.783942
C  -0.447937 0.593701 -2.34613
C  2.051615 1.990186 -0.169997
C  0.451106 2.707151 -1.510075
C  2.034803 -0.388899 -0.513587
C  3.073746 1.936202 0.743451
C  3.073851 -0.472579 0.409519
C  3.574675 0.666416 1.022911
C  -4.189683 -2.02319 -0.223742
C  -0.261301 -0.967524 2.06402
C  -5.338833 -2.253161 0.726402
C  -1.169588 -1.673339 3.044071
H  -0.647087 1.073058 -3.302707
H  -0.097767 -0.421477 -2.529345
H  1.635554 -1.284388 -0.968828
H  3.468037 2.823877 1.216715
H  3.494005 -1.438726 0.650439
H  -4.528358 -1.519997 -1.133537
H  -3.728125 -2.969134 -0.516647
H  0.425158 -1.672654 1.591158
H  0.334314 -0.199861 2.55564
H  -5.803506 -1.315167 1.027004
H  -6.098185 -2.862958 0.237047
H  -5.010982 -2.780222 1.621723
H  -1.694619 -2.506978 2.578096
H  -0.572396 -2.076393 3.862387
H  -1.906768 -0.992188 3.467106
totalener: -2420.14185077 hartree
nucrepener: 2454.56994993 hartree
electener: -4874.71180070 hartree
oneelecener: -8214.44581694 hartree
twoeener: 3339.73401624 hartree
kineticenergy: 2414.03967402 hartree
xcener: -154.018659958530 hartree
chargesum: 0.0000000
charge: -0.073845 -0.111400 -0.407784 0.606251 -0.231199 -0.330917 -0.304216 -0.325361 -0.083871 0.050134 -0.093015 0.193432 0.370513 -0.221187 -0.178965 -0.134528 0.101620 0.020122 0.027750 -0.226364 -0.227557 0.154514 0.141168 0.140806 0.130447 0.125118 0.091966 0.097015 0.086230 0.103351 0.088815 0.079646 0.082789 0.075722 0.087803 0.094997
qa: -0.0738 -0.1114 -0.4078 0.6063 -0.2312 -0.3309 -0.3042 -0.3254 -0.0839 0.0501 -0.0930 0.1934 0.3705 -0.2212 -0.1790 -0.1345 0.1016 0.0201 0.0277 -0.2264 -0.2276 0.1545 0.1412 0.1408 0.1304 0.1251 0.0920 0.0970 0.0862 0.1034 0.0888 0.0796 0.0828 0.0757 0.0878 0.0950
va: 1.2275 2.3062 2.0327 5.4478 2.2387 2.1357 2.1052 2.1958 3.2036 3.7847 3.9432 3.9261 4.3755 3.9298 4.0826 4.0185 3.8918 3.8635 3.8550 3.9579 3.9389 0.9989 1.0251 1.0313 1.0163 1.0128 0.9946 1.0074 1.0094 0.9854 1.0053 1.0085 1.0066 1.0190 1.0099 1.0066
dispcorr: -0.021254103 hartree
energy: -2420.163104877115
dipole: -24.78908 24.31612 -0.47296 -17.11830 15.82942 -1.28888 7.10016 -6.65334 0.44681
magnitude: 1.44380 au
magnitude: 3.66984 debye
