program: Gaussian 09
title: 000058751
version: EM64L-G09RevD.01
frameworkgroup: C1[X(C7H18N5O2)]
method: RPBEPBE
basis: SDD
operation: Freq
keyword: #p
keyword: freq=noraman
keyword: PBEPBE/SDD
title: #p freq=noraman PBEPBE/SDD
converged: YES YES NO NO
title: Mulliken charges:
elementType: O O N N N N N C C C C C C C H H H H H H H H H H H H H H H H H H
charge: -0.169744 -0.237467 -0.121034 -0.076237 -0.325215 -0.636839 0.159327 -0.323619 -0.425396 -0.551842 -0.554856 -0.552725 -0.459730 0.266988 0.251991 0.315660 0.222963 0.244349 0.307772 0.249678 0.253992 0.257982 0.258279 0.298300 0.262683 0.277618 0.261385 0.214106 0.259045 0.364450 0.358210 0.349925
chargesum: 1.00000
title: Mulliken charges with hydrogens summed into heavy atoms:
elementType: O O N N N N N C C C C C C C
charge: -0.169744 -0.237467 -0.121034 -0.076237 0.039235 0.071296 0.159327 0.244032 0.041916 0.259600 0.259705 0.248961 0.013421 0.266988
polarizability: 1.46564539e+02 -2.60887557e+00 1.32075168e+02 1.07662995e+00 4.79587866e+00 8.88178947e+01
1716.lowfreq: -16.4912 -8.6371 -6.4280 -0.0004 -0.0003 0.0004 15.7930 38.0591 51.0894
frequency: 11.5870 37.2782 51.0725 71.1346 88.7155 103.0472 129.5991 159.5229 205.8231 232.2058 242.2456 269.0675 278.4529 283.0222 346.8301 365.5619 378.5529 401.2004 426.2640 433.1550 449.3003 471.1525 515.3658 517.9696 539.5049 605.2534 646.1796 678.2078 719.4860 720.2209 771.1459 852.4225 860.5363 919.6310 926.4143 938.0048 953.1926 1001.6726 1033.2366 1050.6647 1059.8590 1064.5694 1112.9329 1115.9838 1137.5621 1179.5771 1191.9074 1208.1435 1231.7644 1251.6550 1265.7493 1276.6368 1319.3854 1334.1600 1342.6484 1349.8519 1399.3955 1422.4287 1427.2066 1447.2734 1450.1377 1460.2739 1462.2787 1465.5204 1471.4926 1476.4418 1486.4395 1493.9317 1498.9270 1505.9734 1618.9277 1687.0840 2918.0766 3007.5355 3010.9672 3021.3792 3024.4731 3025.2293 3029.6998 3076.3127 3095.2092 3138.2405 3140.1171 3143.4032 3145.0266 3148.7919 3158.2785 3510.9658 3534.0461 3677.1702
redmass: 3.2950 2.8468 6.3615 4.8121 3.0933 5.3173 2.6255 2.0699 2.4967 1.8766 1.2826 1.9869 1.1356 2.9675 2.2352 2.5546 2.8719 5.3832 2.7517 2.2903 1.6099 2.3799 2.1427 1.3211 1.1534 4.4333 4.5989 12.6164 5.8428 3.1989 1.7496 2.9258 2.9590 2.7886 3.3064 2.7341 3.0336 2.2742 2.0378 1.1995 1.5509 2.2137 1.4725 1.5089 2.9136 5.8140 1.4734 1.3414 1.8064 1.7788 1.4403 2.0074 1.3079 1.2486 3.4189 1.4751 1.2105 1.1368 1.1577 1.1041 1.0567 1.0701 1.0865 1.0744 1.0609 1.0605 1.0567 1.1717 1.7291 1.1969 1.1652 7.7580 1.0657 1.0873 1.0590 1.0324 1.0577 1.0375 1.0359 1.1040 1.1068 1.1053 1.1055 1.1053 1.1054 1.1048 1.1048 1.0789 1.0461 1.1043
irintensity: 6.7067 2.0519 2.3903 5.5328 3.5461 9.2130 1.1610 1.8420 3.3731 3.5264 1.2931 1.9596 0.7668 8.7371 1.8132 0.3117 6.6083 0.9516 1.8631 3.1865 3.8373 3.0987 51.9420 244.2909 139.0291 3.1245 12.0357 16.0470 14.7686 0.2854 12.6301 11.8804 24.6663 0.9585 21.9201 35.5055 12.5281 20.8899 16.1890 0.0957 1.7104 5.4911 1.5160 6.5200 7.1407 383.8496 40.6034 17.1709 0.2635 1.0465 11.5298 77.0452 8.9820 32.0904 82.1120 19.8820 10.6538 13.7703 15.1070 4.1586 1.3979 5.7278 11.0703 9.2598 6.2775 19.3343 63.7594 15.8630 208.3439 67.7785 85.6828 456.4846 43.1011 11.4854 30.4286 5.3248 20.4486 4.9537 26.9844 16.9864 9.3689 0.6661 3.3570 1.1115 6.9485 4.6072 7.2154 78.6384 94.3123 38.6384
temp: 298.150 k
press: 1.00000 atm
elementType: 8 8 7 7 7 7 7 6 6 6 6 6 6 6 1 1 1 1 1 1 1 1 1 1 1 1 1 1 1 1 1 1
symmnumber: 1
zpe: 715994.5 jmol-1
zpe.correction: 0.272708 hartree
zpe.thermalcorrener: 0.289175 hartree
zpe.thermalcorrenthalpy: 0.290119 hartree
zpe.thermalcorrgfe: 0.227273 hartree
zpe.sumelectzpe: -700.253520 hartree
zpe.sumelectthermal: -700.237053 hartree
zpe.sumelectthermalent: -700.236109 hartree
zpe.sumelectthermalfe: -700.298955 hartree
dipole: -5.0816 4.4171 1.3340
dipole: 6.8639
quadrupole: -25.4528 -73.0398 -78.0089
quadrupole: 16.3172 3.3385 1.8927
quadrupole: 33.3810 -14.2059 -19.1751 16.3172 3.3385 1.8927
hfenergy: -700.5262281 hartree
pointgroup: C01 [X(C7H18N5O2)]
dipole: -2.04875 1.6777874 0.5293318 debye
polarizability: 146.742262|-2.0149303|132.0824053|-0.0847316|4.0360606|88.6329341 unknown
InChI: InChI=1S/C7H18N5O2/c1-12(2,3)6-4-5-9-7(8)10-11(13)14/h10H,4-6,8H2,1-3H3
charge 1 multiplicity 1
32 atoms
O  2.373113 -2.533659 -0.505031
O  0.610054 -1.505515 0.536691
N  -2.895718 -0.445997 0.118562
N  0.61331 1.144023 -0.590604
N  2.450515 -0.276953 -0.183574
N  2.609767 1.933885 0.557471
N  1.756947 -1.504804 -0.051139
C  -1.928386 0.67513 0.584234
C  -1.709948 1.834177 -0.409357
C  -2.357599 -1.139291 -1.13563
C  -2.963495 -1.485929 1.239137
C  -4.285971 0.115589 -0.146561
C  -0.233652 2.314026 -0.310083
C  1.801751 1.005407 -0.084304
H  -2.332779 1.036156 1.546705
H  -0.968717 0.157429 0.752717
H  -1.858742 1.50318 -1.452151
H  -2.39936 2.675677 -0.219665
H  -1.317983 -1.443251 -0.943752
H  -2.988183 -2.017413 -1.345053
H  -2.392622 -0.447237 -1.987708
H  -3.311894 -0.998974 2.16286
H  -3.665046 -2.283416 0.949461
H  -1.956844 -1.905611 1.388431
H  -4.676098 0.562918 0.780739
H  -4.223288 0.88236 -0.93205
H  -4.948766 -0.699427 -0.476396
H  -0.039048 2.760026 0.692884
H  -0.07326 3.112235 -1.061616
H  3.362516 -0.403594 -0.636504
H  2.419963 2.930549 0.473319
H  3.389964 1.638305 1.142965
