program: Orca
programVersion: 5.0.2
elementType: S S P O O O O C C C C C C C C C C C C H H H H H H H H H H H H H H H H H
charge: 0
multiplicity: 1
keywords: wb97x-d3
keywords: def2-TZVPP
keywords: def2/J RIJCOSX
keywords: DEFGRID2
keywords: scfconv7
keywords: smallprint printgap noloewdin
keywords: NOSOSCF
formula: C12H17O4PS2
InChI: InChI=1/C12H17O4PS2/c1-4-16-12(13)11(10-8-6-5-7-9-10)19-17(18,14-2)15-3/h5-9,11H,4H2,1-3H3
36 atoms
S  0.058782 0.562295 1.145799
S  3.1724 0.25256 2.187308
P  2.050216 0.302783 0.629063
O  -0.985547 -1.941608 -0.019293
O  2.405961 1.423263 -0.463302
O  1.982904 -0.994327 -0.303058
O  -0.752388 -1.326188 -2.15886
C  -0.763417 0.367931 -0.484393
C  -2.171545 0.903908 -0.379127
C  -0.807458 -1.065856 -0.981365
C  -3.061735 0.433205 0.584015
C  -2.595312 1.8695 -1.285991
C  -4.354926 0.930749 0.638303
C  -3.892222 2.360647 -1.233435
C  -4.774738 1.892959 -0.270823
C  -1.120964 -3.336114 -0.360107
C  0.216972 -4.002347 -0.575504
C  2.667801 2.77179 -0.064661
C  3.148154 -1.448507 -1.011509
H  -0.217445 0.956098 -1.221859
H  -2.756725 -0.319013 1.300657
H  -1.907864 2.239815 -2.036148
H  -5.037381 0.562167 1.392614
H  -4.210484 3.110657 -1.945209
H  -5.785113 2.27735 -0.227322
H  -1.631824 -3.770209 0.496769
H  -1.769804 -3.445968 -1.229405
H  0.052468 -5.070749 -0.718083
H  0.731207 -3.627413 -1.459321
H  0.867515 -3.880363 0.290229
H  1.769922 3.239962 0.339187
H  2.978668 3.30635 -0.957459
H  3.463638 2.815949 0.678188
H  4.012518 -1.505286 -0.349527
H  3.37025 -0.791882 -1.850685
H  2.917165 -2.443366 -1.381866
elementType: S P O C H
totalener: -1906.36175844 hartree
nucrepener: 2015.84759077 hartree
electener: -3922.20934921 hartree
oneelecener: -6632.50364587 hartree
twoeener: 2710.29429666 hartree
cpcmener: -0.03134624 hartree
kineticenergy: 1900.94979186 hartree
xcener: -128.465780114822 hartree
chargesum: 0.0000000
charge: -0.142427 -0.435890 0.614052 -0.268321 -0.334904 -0.326509 -0.469129 0.168389 0.023998 0.366804 -0.205212 -0.196503 -0.169087 -0.146821 -0.157355 0.030263 -0.263706 -0.100977 -0.105389 0.130712 0.143612 0.144699 0.162171 0.161657 0.162843 0.111907 0.096543 0.107754 0.087597 0.091153 0.114498 0.130644 0.112634 0.113211 0.130040 0.117051
qa: -0.1424 -0.4359 0.6141 -0.2683 -0.3349 -0.3265 -0.4691 0.1684 0.0240 0.3668 -0.2052 -0.1965 -0.1691 -0.1468 -0.1574 0.0303 -0.2637 -0.1010 -0.1054 0.1307 0.1436 0.1447 0.1622 0.1617 0.1628 0.1119 0.0965 0.1078 0.0876 0.0912 0.1145 0.1306 0.1126 0.1132 0.1300 0.1171
va: 2.3135 2.0371 5.4336 2.1413 2.0545 2.1012 2.0288 3.7302 3.5844 4.2377 3.9659 3.9774 3.9466 3.8847 3.9021 3.8395 3.9135 3.8339 3.8444 1.0423 1.0193 1.0043 0.9905 0.9903 0.9884 0.9953 1.0095 1.0095 1.0117 1.0047 0.9919 0.9903 1.0042 1.0015 0.9932 0.9895
dispcorr: -0.018806337 hartree
energy: -1906.380564773189
dipole: -4.65764 3.97950 -0.67814 -6.47016 6.65886 0.18871 -9.27349 8.24158 -1.03191
magnitude: 1.24913 au
magnitude: 3.17503 debye
