program: Orca
programVersion: 5.0.2
elementType: S S P O O O O C C C C C C C C C C C C H H H H H H H H H H H H H H H H H
charge: 0
multiplicity: 1
keywords: wb97x-d3
keywords: def2-TZVPP
keywords: def2/J RIJCOSX
keywords: DEFGRID2
keywords: scfconv7
keywords: smallprint printgap noloewdin
keywords: NOSOSCF
formula: C12H17O4PS2
InChI: InChI=1/C12H17O4PS2/c1-4-16-12(13)11(10-8-6-5-7-9-10)19-17(18,14-2)15-3/h5-9,11H,4H2,1-3H3
36 atoms
S  0.63812 -0.475242 0.834939
S  3.445684 0.968614 1.598128
P  2.134633 0.827457 0.205261
O  -1.946031 -2.263918 -0.301223
O  1.398231 2.150806 -0.302283
O  2.619725 0.339503 -1.236514
O  -0.167976 -2.477591 -1.641482
C  -0.557653 -0.374044 -0.573874
C  -1.732648 0.504271 -0.254834
C  -0.870572 -1.821522 -0.91164
C  -2.146143 1.433439 -1.203232
C  -2.411062 0.428786 0.959679
C  -3.229624 2.266092 -0.951232
C  -3.490886 1.259346 1.2115
C  -3.905868 2.179398 0.255809
C  -2.302538 -3.655443 -0.446149
C  -1.490289 -4.538403 0.470346
C  0.778005 3.035351 0.639013
C  3.322126 -0.90118 -1.374528
H  -0.025292 0.023217 -1.439007
H  -1.618751 1.508783 -2.146449
H  -2.095982 -0.270583 1.723876
H  -3.53927 2.984317 -1.699004
H  -4.009559 1.190196 2.158617
H  -4.748107 2.828477 0.456357
H  -3.357178 -3.689949 -0.182255
H  -2.206241 -3.9567 -1.489391
H  -1.855702 -5.561995 0.385166
H  -0.431763 -4.542749 0.213275
H  -1.595863 -4.232985 1.511172
H  1.518785 3.470003 1.309762
H  0.014099 2.522034 1.224899
H  0.309364 3.824096 0.057397
H  4.181348 -0.945707 -0.705166
H  3.667255 -0.948879 -2.40343
H  2.661026 -1.745201 -1.178235
elementType: S P O C H
totalener: -1906.36122771 hartree
nucrepener: 2010.22893716 hartree
electener: -3916.59016486 hartree
oneelecener: -6620.82097606 hartree
twoeener: 2704.23081119 hartree
cpcmener: -0.02926319 hartree
kineticenergy: 1900.95413730 hartree
xcener: -128.466706969594 hartree
chargesum: -0.0000000
charge: -0.154785 -0.429255 0.632980 -0.266223 -0.335062 -0.331345 -0.467108 0.128031 0.011540 0.404637 -0.186859 -0.202780 -0.149004 -0.154498 -0.162302 0.029847 -0.250321 -0.124949 -0.106540 0.123197 0.144200 0.132463 0.160810 0.161379 0.162343 0.109354 0.097813 0.100121 0.088615 0.090956 0.131893 0.117085 0.136064 0.115764 0.132704 0.109237
qa: -0.1548 -0.4293 0.6330 -0.2662 -0.3351 -0.3313 -0.4671 0.1280 0.0115 0.4046 -0.1869 -0.2028 -0.1490 -0.1545 -0.1623 0.0298 -0.2503 -0.1249 -0.1065 0.1232 0.1442 0.1325 0.1608 0.1614 0.1623 0.1094 0.0978 0.1001 0.0886 0.0910 0.1319 0.1171 0.1361 0.1158 0.1327 0.1092
va: 2.2853 2.0461 5.4441 2.1674 2.0897 2.0958 2.0238 3.6871 3.4928 4.2056 3.9340 3.9374 3.8855 3.9227 3.9001 3.8456 3.9205 3.8303 3.8372 1.0530 1.0049 1.0189 0.9902 0.9900 0.9888 0.9974 1.0086 1.0075 1.0134 1.0034 1.0048 0.9866 0.9898 1.0032 0.9904 0.9979
dispcorr: -0.019112851 hartree
energy: -1906.380340558734
dipole: -14.20570 11.81784 -2.38786 -7.65817 7.49227 -0.16590 -2.38416 2.01719 -0.36697
magnitude: 2.42158 au
magnitude: 6.15516 debye
