program: Orca
programVersion: 5.0.2
elementType: S S P O O O O C C C C C C C C C C C C H H H H H H H H H H H H H H H H H
charge: 0
multiplicity: 1
keywords: wb97x-d3
keywords: def2-TZVPP
keywords: def2/J RIJCOSX
keywords: DEFGRID2
keywords: scfconv7
keywords: smallprint printgap noloewdin
keywords: NOSOSCF
formula: C12H17O4PS2
InChI: InChI=1/C12H17O4PS2/c1-4-16-12(13)11(10-8-6-5-7-9-10)19-17(18,14-2)15-3/h5-9,11H,4H2,1-3H3
36 atoms
S  0.251057 0.991876 0.61002
S  1.853737 -0.501252 -2.020478
P  2.018851 0.342794 -0.297871
O  -0.017636 -1.959845 0.595073
O  2.724997 -0.486953 0.870755
O  2.894029 1.68773 -0.254112
O  -2.246675 -1.952803 0.515957
C  -1.048832 -0.005503 -0.211917
C  -2.33205 0.77351 -0.150997
C  -1.183244 -1.404802 0.361515
C  -2.895798 1.264539 -1.322254
C  -2.960597 1.026363 1.066854
C  -4.078563 1.991001 -1.283048
C  -4.138778 1.75529 1.105978
C  -4.701987 2.237555 -0.069246
C  0.011257 -3.34672 0.990343
C  1.452255 -3.778355 1.05715
C  3.968227 -1.16428 0.629065
C  2.695344 2.720543 -1.22211
H  -0.741155 -0.127725 -1.257527
H  -2.410949 1.074235 -2.271734
H  -2.536452 0.651629 1.991229
H  -4.51106 2.362751 -2.202402
H  -4.620732 1.945101 2.055913
H  -5.623599 2.803518 -0.036771
H  -0.479158 -3.453554 1.959228
H  -0.540468 -3.939553 0.259121
H  1.951287 -3.656114 0.096072
H  2.006692 -3.229219 1.81726
H  1.488318 -4.835602 1.31867
H  4.186577 -1.740291 1.524392
H  4.772917 -0.45036 0.455165
H  3.890687 -1.83956 -0.222811
H  2.79179 2.334053 -2.236468
H  3.466062 3.465573 -1.047073
H  1.715553 3.184136 -1.104964
elementType: S P O C H
totalener: -1906.36016903 hartree
nucrepener: 2012.40203152 hartree
electener: -3918.76220055 hartree
oneelecener: -6626.02537781 hartree
twoeener: 2707.26317726 hartree
cpcmener: -0.03148262 hartree
kineticenergy: 1900.96077988 hartree
xcener: -128.467424972103 hartree
chargesum: -0.0000000
charge: -0.144486 -0.446979 0.682124 -0.265317 -0.350385 -0.354411 -0.462326 0.158352 -0.006275 0.387659 -0.172128 -0.226337 -0.151285 -0.144585 -0.159721 0.036301 -0.264710 -0.140234 -0.105713 0.126274 0.145365 0.146753 0.160351 0.162301 0.162192 0.105453 0.102092 0.082007 0.089019 0.105441 0.134743 0.143005 0.114270 0.109821 0.130939 0.110428
qa: -0.1445 -0.4470 0.6821 -0.2653 -0.3504 -0.3544 -0.4623 0.1584 -0.0063 0.3877 -0.1721 -0.2263 -0.1513 -0.1446 -0.1597 0.0363 -0.2647 -0.1402 -0.1057 0.1263 0.1454 0.1468 0.1604 0.1623 0.1622 0.1055 0.1021 0.0820 0.0890 0.1054 0.1347 0.1430 0.1143 0.1098 0.1309 0.1104
va: 2.3148 2.0106 5.3879 2.1555 2.0760 2.0875 2.0396 3.7165 3.6016 4.1938 3.9365 3.9781 3.8927 3.9058 3.8992 3.8406 3.9697 3.8388 3.8484 1.0449 1.0043 1.0086 0.9911 0.9899 0.9891 0.9937 0.9966 1.0066 0.9983 1.0094 0.9835 0.9950 0.9940 1.0027 0.9907 0.9940
dispcorr: -0.018324846 hartree
energy: -1906.378493878448
dipole: 2.42105 -1.15047 1.27058 -5.58352 5.93344 0.34993 2.03277 -1.84320 0.18957
magnitude: 1.33145 au
magnitude: 3.38427 debye
