program: Orca
programVersion: 5.0.2
elementType: S S P O O O O C C C C C C C C C C C C H H H H H H H H H H H H H H H H H
charge: 0
multiplicity: 1
keywords: wb97x-d3
keywords: def2-TZVPP
keywords: def2/J RIJCOSX
keywords: DEFGRID2
keywords: scfconv7
keywords: smallprint printgap noloewdin
keywords: NOSOSCF
formula: C12H17O4PS2
InChI: InChI=1/C12H17O4PS2/c1-4-16-12(13)11(10-8-6-5-7-9-10)19-17(18,14-2)15-3/h5-9,11H,4H2,1-3H3
36 atoms
S  1.048283 -0.887649 0.158019
S  1.761846 2.114704 -1.339717
P  1.719228 1.083456 0.284193
O  -0.856986 -2.875166 -0.334118
O  3.122437 0.837993 1.017592
O  0.849128 1.669946 1.486778
O  -1.691664 -2.101856 -2.258406
C  -0.444134 -0.61367 -0.874702
C  -1.471423 0.249923 -0.186134
C  -1.056694 -1.950302 -1.244996
C  -1.962772 -0.078411 1.075327
C  -1.921517 1.402515 -0.81805
C  -2.887337 0.745306 1.696093
C  -2.848498 2.227793 -0.19368
C  -3.329853 1.90273 1.065222
C  -1.436163 -4.181628 -0.543275
C  -1.105806 -5.023068 0.660642
C  4.293772 0.512926 0.258887
C  0.501775 3.057682 1.576428
H  -0.128775 -0.135412 -1.803563
H  -1.610043 -0.965566 1.586326
H  -1.538671 1.662774 -1.796472
H  -3.260053 0.487244 2.678555
H  -3.186569 3.127386 -0.69089
H  -4.045463 2.548168 1.557289
H  -2.514752 -4.079315 -0.669498
H  -1.020881 -4.613778 -1.454888
H  -0.029746 -5.137643 0.790805
H  -1.527233 -4.601993 1.573235
H  -1.532159 -6.016298 0.523484
H  5.103354 0.394408 0.973604
H  4.541991 1.312777 -0.438099
H  4.165912 -0.419283 -0.292712
H  1.379447 3.668504 1.785417
H  -0.201027 3.141628 2.400891
H  0.026425 3.40693 0.660872
elementType: S P O C H
totalener: -1906.35932320 hartree
nucrepener: 2027.60431600 hartree
electener: -3933.96363920 hartree
oneelecener: -6656.24363462 hartree
twoeener: 2722.27999542 hartree
cpcmener: -0.02925031 hartree
kineticenergy: 1900.97819466 hartree
xcener: -128.470986252931 hartree
chargesum: -0.0000000
charge: -0.152250 -0.445160 0.668192 -0.272697 -0.362190 -0.338206 -0.465920 0.134038 0.031641 0.416221 -0.187396 -0.226017 -0.155597 -0.139726 -0.163815 0.028552 -0.251817 -0.108500 -0.125967 0.128867 0.137947 0.136226 0.161125 0.160464 0.161815 0.103174 0.108298 0.089553 0.090737 0.092572 0.131391 0.114254 0.113209 0.144670 0.132467 0.109847
qa: -0.1523 -0.4452 0.6682 -0.2727 -0.3622 -0.3382 -0.4659 0.1340 0.0316 0.4162 -0.1874 -0.2260 -0.1556 -0.1397 -0.1638 0.0286 -0.2518 -0.1085 -0.1260 0.1289 0.1379 0.1362 0.1611 0.1605 0.1618 0.1032 0.1083 0.0896 0.0907 0.0926 0.1314 0.1143 0.1132 0.1447 0.1325 0.1098
va: 2.3330 2.0029 5.4019 2.1500 2.0894 2.0724 2.0417 3.8135 3.3744 4.1812 3.9435 3.9760 3.9194 3.8722 3.8970 3.8415 3.9740 3.8431 3.8222 1.0491 1.0230 1.0154 0.9903 0.9906 0.9888 0.9965 0.9952 1.0027 1.0019 1.0070 0.9915 1.0022 0.9924 0.9931 0.9885 0.9973
dispcorr: -0.019427172 hartree
energy: -1906.378750370035
dipole: -6.47832 6.57108 0.09275 -7.16310 6.74802 -0.41508 6.39479 -4.84856 1.54623
magnitude: 1.60366 au
magnitude: 4.07617 debye
