program: Orca
programVersion: 5.0.2
elementType: S S P O O O O C C C C C C C C C C C C H H H H H H H H H H H H H H H H H
charge: 0
multiplicity: 1
keywords: wb97x-d3
keywords: def2-TZVPP
keywords: def2/J RIJCOSX
keywords: DEFGRID2
keywords: scfconv7
keywords: smallprint printgap noloewdin
keywords: NOSOSCF
formula: C12H17O4PS2
InChI: InChI=1/C12H17O4PS2/c1-4-16-12(13)11(10-8-6-5-7-9-10)19-17(18,14-2)15-3/h5-9,11H,4H2,1-3H3
36 atoms
S  1.321431 -0.550056 0.803304
S  1.668902 1.321217 -2.047002
P  1.770377 1.262798 -0.125374
O  -1.534075 -2.824347 -0.483562
O  3.205693 1.55662 0.525593
O  0.852552 2.294868 0.675031
O  -0.253777 -2.846162 1.359011
C  -0.207109 -0.949674 -0.124603
C  -1.308744 0.057588 0.090048
C  -0.647285 -2.320512 0.347468
C  -1.870729 0.705745 -1.002481
C  -1.761146 0.35681 1.372796
C  -2.869099 1.654129 -0.816682
C  -2.756036 1.302942 1.556728
C  -3.310027 1.957611 0.462275
C  -2.10889 -4.115198 -0.189163
C  -1.183821 -5.248089 -0.564066
C  4.391415 0.975044 -0.028623
C  0.384276 3.51581 0.088696
H  0.041088 -1.003469 -1.18728
H  -1.520483 0.478232 -2.000945
H  -1.326109 -0.135944 2.233984
H  -3.295103 2.159136 -1.673638
H  -3.098657 1.533177 2.556902
H  -4.08175 2.701834 0.608989
H  -2.39866 -4.159308 0.861201
H  -3.016085 -4.144525 -0.788832
H  -0.88673 -5.188949 -1.611029
H  -0.286553 -5.276089 0.052703
H  -1.711871 -6.191389 -0.422368
H  4.551593 1.31437 -1.051452
H  4.34741 -0.114739 -0.012295
H  5.218599 1.304818 0.594054
H  -0.311565 3.947969 0.802816
H  -0.133626 3.330205 -0.851115
H  1.206305 4.210544 -0.081388
elementType: S P O C H
totalener: -1906.35974937 hartree
nucrepener: 2024.82892896 hartree
electener: -3931.18867833 hartree
oneelecener: -6651.00874378 hartree
twoeener: 2719.82006545 hartree
cpcmener: -0.02826918 hartree
kineticenergy: 1900.96975912 hartree
xcener: -128.471510038082 hartree
chargesum: -0.0000000
charge: -0.143045 -0.448949 0.669931 -0.281963 -0.362692 -0.337785 -0.454109 0.099110 0.034074 0.407619 -0.206476 -0.172754 -0.146501 -0.161952 -0.158038 0.030054 -0.250435 -0.108805 -0.127358 0.133185 0.135063 0.136572 0.159152 0.161417 0.161496 0.097378 0.113113 0.090151 0.088762 0.098519 0.113973 0.112604 0.131333 0.132516 0.109984 0.144857
qa: -0.1430 -0.4489 0.6699 -0.2820 -0.3627 -0.3378 -0.4541 0.0991 0.0341 0.4076 -0.2065 -0.1728 -0.1465 -0.1620 -0.1580 0.0301 -0.2504 -0.1088 -0.1274 0.1332 0.1351 0.1366 0.1592 0.1614 0.1615 0.0974 0.1131 0.0902 0.0888 0.0985 0.1140 0.1126 0.1313 0.1325 0.1100 0.1449
va: 2.3455 1.9986 5.3972 2.1670 2.0889 2.0738 2.0400 3.8555 3.3305 4.2066 3.9576 3.9404 3.8789 3.9209 3.8884 3.8486 3.9179 3.8448 3.8234 1.0488 1.0157 1.0218 0.9911 0.9898 0.9887 1.0071 0.9960 1.0041 1.0129 1.0065 1.0020 0.9925 0.9915 0.9884 0.9974 0.9930
dispcorr: -0.019345604 hartree
energy: -1906.379094973164
dipole: -8.91726 7.96479 -0.95246 -6.28274 6.44922 0.16647 -1.75356 1.23773 -0.51583
magnitude: 1.09589 au
magnitude: 2.78554 debye
