program: Orca
programVersion: 5.0.2
elementType: S S P O O O O C C C C C C C C C C C C H H H H H H H H H H H H H H H H H
charge: 0
multiplicity: 1
keywords: wb97x-d3
keywords: def2-TZVPP
keywords: def2/J RIJCOSX
keywords: DEFGRID2
keywords: scfconv7
keywords: smallprint printgap noloewdin
keywords: NOSOSCF
formula: C12H17O4PS2
InChI: InChI=1/C12H17O4PS2/c1-4-16-12(13)11(10-8-6-5-7-9-10)19-17(18,14-2)15-3/h5-9,11H,4H2,1-3H3
36 atoms
S  1.106174 -0.738042 0.060581
S  1.542402 2.297563 -1.435701
P  1.702661 1.270237 0.178278
O  -0.737211 -2.807254 -0.445621
O  3.165891 1.078738 0.803352
O  0.911361 1.945128 1.385788
O  -1.639698 -2.001233 -2.325371
C  -0.43217 -0.510573 -0.912249
C  -1.481861 0.264686 -0.156332
C  -0.991734 -1.85971 -1.318681
C  -1.923222 -0.151917 1.097845
C  -2.020055 1.412463 -0.725779
C  -2.888517 0.577944 1.772821
C  -2.98622 2.143671 -0.046736
C  -3.42211 1.728204 1.202777
C  -1.28743 -4.122457 -0.682867
C  -0.873748 -5.003898 0.46514
C  4.267152 0.666191 -0.016073
C  0.897685 1.397089 2.711812
H  -0.170516 0.020565 -1.829487
H  -1.505877 -1.037945 1.560415
H  -1.676099 1.742366 -1.697817
H  -3.224009 0.24896 2.747488
H  -3.393909 3.039661 -0.495903
H  -4.171604 2.299377 1.734964
H  -2.373259 -4.048496 -0.751285
H  -0.906923 -4.50443 -1.630447
H  0.210542 -5.081735 0.544939
H  -1.270622 -4.64433 1.413979
H  -1.267336 -6.00568 0.298935
H  4.172775 -0.382307 -0.298724
H  5.166537 0.795134 0.579852
H  4.340343 1.280035 -0.914299
H  1.814891 1.653843 3.239513
H  0.773202 0.31353 2.702327
H  0.049195 1.84281 3.223781
elementType: S P O C H
totalener: -1906.36047438 hartree
nucrepener: 2027.77466681 hartree
electener: -3934.13514120 hartree
oneelecener: -6656.41257269 hartree
twoeener: 2722.27743150 hartree
cpcmener: -0.03206676 hartree
kineticenergy: 1900.95929395 hartree
xcener: -128.468466172436 hartree
chargesum: 0.0000000
charge: -0.174640 -0.431648 0.668235 -0.274021 -0.353274 -0.340319 -0.465424 0.144851 0.014703 0.413678 -0.199244 -0.197392 -0.166956 -0.150930 -0.150345 0.028706 -0.251864 -0.106484 -0.129072 0.130974 0.141480 0.137151 0.160644 0.160873 0.162251 0.104574 0.107452 0.089407 0.090790 0.092851 0.117126 0.130788 0.108982 0.138692 0.117242 0.130165
qa: -0.1746 -0.4316 0.6682 -0.2740 -0.3533 -0.3403 -0.4654 0.1449 0.0147 0.4137 -0.1992 -0.1974 -0.1670 -0.1509 -0.1503 0.0287 -0.2519 -0.1065 -0.1291 0.1310 0.1415 0.1372 0.1606 0.1609 0.1623 0.1046 0.1075 0.0894 0.0908 0.0929 0.1171 0.1308 0.1090 0.1387 0.1172 0.1302
va: 2.3021 2.0386 5.4110 2.1506 2.0850 2.0875 2.0420 3.7889 3.3838 4.1809 3.9129 3.9920 3.9174 3.9128 3.8952 3.8409 3.9741 3.8464 3.8388 1.0522 1.0203 1.0131 0.9905 0.9901 0.9877 0.9962 0.9958 1.0028 1.0019 1.0070 0.9910 0.9904 1.0022 0.9953 0.9953 0.9868
dispcorr: -0.019243368 hartree
energy: -1906.379717750736
dipole: -4.95986 5.40563 0.44577 -13.21844 11.45043 -1.76800 9.49678 -7.16124 2.33554
magnitude: 2.96299 au
magnitude: 7.53131 debye
