program: Orca
programVersion: 5.0.2
elementType: S S P O O O O C C C C C C C C C C C C H H H H H H H H H H H H H H H H H
charge: 0
multiplicity: 1
keywords: wb97x-d3
keywords: def2-TZVPP
keywords: def2/J RIJCOSX
keywords: DEFGRID2
keywords: scfconv7
keywords: smallprint printgap noloewdin
keywords: NOSOSCF
formula: C12H17O4PS2
InChI: InChI=1/C12H17O4PS2/c1-4-16-12(13)11(10-8-6-5-7-9-10)19-17(18,14-2)15-3/h5-9,11H,4H2,1-3H3
36 atoms
S  1.136968 -0.700332 0.080844
S  1.457625 2.235872 -1.643058
P  1.691911 1.3232 0.03087
O  -0.723955 -2.821021 -0.197532
O  3.179448 1.203319 0.61409
O  0.924931 2.060534 1.217355
O  -1.560672 -2.203855 -2.17699
C  -0.438379 -0.570379 -0.848552
C  -1.493853 0.208569 -0.103435
C  -0.959073 -1.959697 -1.161287
C  -2.13734 1.259757 -0.745736
C  -1.846372 -0.114239 1.204895
C  -3.124009 1.983408 -0.088877
C  -2.829643 0.61026 1.859165
C  -3.471386 1.66086 1.214184
C  -1.238074 -4.163693 -0.339977
C  -0.95102 -4.902194 0.939543
C  4.26318 0.770386 -0.21809
C  0.988697 1.614303 2.579733
H  -0.224391 -0.083061 -1.801134
H  -1.863199 1.517502 -1.760717
H  -1.345904 -0.921182 1.72494
H  -3.616103 2.802289 -0.596559
H  -3.095036 0.354656 2.876469
H  -4.236987 2.226339 1.728788
H  -2.309563 -4.119682 -0.535102
H  -0.751682 -4.640809 -1.191243
H  -1.326298 -5.920936 0.84883
H  0.117726 -4.957068 1.144417
H  -1.448135 -4.438596 1.790762
H  5.173198 0.908319 0.358333
H  4.319576 1.365792 -1.129222
H  4.160958 -0.282739 -0.479553
H  0.904515 0.529955 2.656003
H  0.147559 2.069392 3.095262
H  1.917689 1.941197 3.044091
elementType: S P O C H
totalener: -1906.36070293 hartree
nucrepener: 2025.63298763 hartree
electener: -3931.99369056 hartree
oneelecener: -6652.10982945 hartree
twoeener: 2720.11613889 hartree
cpcmener: -0.03192125 hartree
kineticenergy: 1900.96602312 hartree
xcener: -128.469518749977 hartree
chargesum: 0.0000000
charge: -0.173941 -0.431420 0.667516 -0.276082 -0.352328 -0.341160 -0.463431 0.151090 0.013538 0.409985 -0.196239 -0.201698 -0.151694 -0.166937 -0.149869 0.029688 -0.250913 -0.106742 -0.128151 0.128701 0.138462 0.141681 0.160964 0.160502 0.162223 0.102042 0.108696 0.092927 0.089713 0.089568 0.130897 0.110063 0.116515 0.117405 0.130229 0.138202
qa: -0.1739 -0.4314 0.6675 -0.2761 -0.3523 -0.3412 -0.4634 0.1511 0.0135 0.4100 -0.1962 -0.2017 -0.1517 -0.1669 -0.1499 0.0297 -0.2509 -0.1067 -0.1282 0.1287 0.1385 0.1417 0.1610 0.1605 0.1622 0.1020 0.1087 0.0929 0.0897 0.0896 0.1309 0.1101 0.1165 0.1174 0.1302 0.1382
va: 2.3024 2.0384 5.4098 2.1499 2.0850 2.0885 2.0428 3.7769 3.3802 4.1874 3.9944 3.9197 3.9103 3.9227 3.8957 3.8425 3.9725 3.8458 3.8389 1.0547 1.0125 1.0199 0.9901 0.9907 0.9878 0.9973 0.9949 1.0070 1.0028 1.0023 0.9904 1.0017 0.9913 0.9951 0.9869 0.9953
dispcorr: -0.019144129 hartree
energy: -1906.379847060398
dipole: -4.92473 5.41596 0.49122 -12.51147 10.95584 -1.55564 10.79297 -8.31423 2.47874
magnitude: 2.96740 au
magnitude: 7.54253 debye
