program: Orca
programVersion: 5.0.2
elementType: S S P O O O O C C C C C C C C C C C C H H H H H H H H H H H H H H H H H
charge: 0
multiplicity: 1
keywords: wb97x-d3
keywords: def2-TZVPP
keywords: def2/J RIJCOSX
keywords: DEFGRID2
keywords: scfconv7
keywords: smallprint printgap noloewdin
keywords: NOSOSCF
formula: C12H17O4PS2
InChI: InChI=1/C12H17O4PS2/c1-4-16-12(13)11(10-8-6-5-7-9-10)19-17(18,14-2)15-3/h5-9,11H,4H2,1-3H3
36 atoms
S  0.464486 1.20861 -0.041416
S  2.029877 -1.051282 -2.047617
P  2.209229 0.179344 -0.582545
O  -0.027178 -1.446642 1.007915
O  2.804789 -0.536224 0.710541
O  3.224947 1.407041 -0.753381
O  -1.363159 -2.250452 -0.597759
C  -0.834945 0.065681 -0.627775
C  -2.162462 0.689295 -0.266975
C  -0.760651 -1.345553 -0.0740
C  -3.004413 1.14385 -1.274898
C  -2.55152 0.820313 1.064871
C  -4.225452 1.723793 -0.958145
C  -3.770831 1.400563 1.378703
C  -4.609896 1.854134 0.368587
C  0.101254 -2.729089 1.653037
C  -1.064003 -3.004685 2.571428
C  2.886559 0.096295 1.99481
C  3.148209 2.266421 -1.896055
H  -0.75441 -0.010379 -1.712544
H  -2.703884 1.044785 -2.310552
H  -1.907427 0.473288 1.863879
H  -4.874203 2.07435 -1.749804
H  -4.066359 1.499212 2.414822
H  -5.560511 2.307921 0.616297
H  0.22367 -3.511593 0.903542
H  1.029577 -2.654272 2.216157
H  -1.169678 -2.222544 3.323402
H  -2.005113 -3.099832 2.030649
H  -0.884791 -3.94468 3.093815
H  1.911994 0.458071 2.322191
H  3.597251 0.921861 1.983377
H  3.233141 -0.662808 2.6907
H  3.283626 1.701568 -2.818177
H  3.952105 2.990536 -1.796485
H  2.194143 2.793805 -1.930765
elementType: S P O C H
totalener: -1906.36006258 hartree
nucrepener: 2032.85270530 hartree
electener: -3939.21276788 hartree
oneelecener: -6666.61795225 hartree
twoeener: 2727.40518437 hartree
cpcmener: -0.03369241 hartree
kineticenergy: 1900.96560208 hartree
xcener: -128.469725689093 hartree
chargesum: -0.0000000
charge: -0.161505 -0.432497 0.661365 -0.255789 -0.341922 -0.349930 -0.463729 0.174944 0.015604 0.339059 -0.193952 -0.200351 -0.143747 -0.170497 -0.155398 0.033900 -0.253624 -0.133481 -0.106104 0.119340 0.146064 0.149773 0.162129 0.162111 0.163194 0.098813 0.107049 0.091471 0.090769 0.103300 0.114076 0.141113 0.132528 0.111297 0.131393 0.113234
qa: -0.1615 -0.4325 0.6614 -0.2558 -0.3419 -0.3499 -0.4637 0.1749 0.0156 0.3391 -0.1940 -0.2004 -0.1437 -0.1705 -0.1554 0.0339 -0.2536 -0.1335 -0.1061 0.1193 0.1461 0.1498 0.1621 0.1621 0.1632 0.0988 0.1070 0.0915 0.0908 0.1033 0.1141 0.1411 0.1325 0.1113 0.1314 0.1132
va: 2.3007 2.0353 5.4043 2.1211 2.0862 2.0841 2.0389 3.7616 3.5723 4.2190 3.9718 3.9521 3.8827 3.9404 3.8983 3.8307 3.9305 3.8324 3.8446 1.0467 1.0034 1.0133 0.9901 0.9909 0.9884 1.0124 0.9940 1.0032 1.0121 1.0071 0.9950 0.9936 0.9866 0.9996 0.9909 0.9948
dispcorr: -0.018925478 hartree
energy: -1906.378988059173
dipole: -6.93915 6.92336 -0.01578 -0.12046 1.98960 1.86913 12.00944 -9.96572 2.04372
magnitude: 2.76960 au
magnitude: 7.03977 debye
