program: Gaussian 09
title: 000058735
version: EM64L-G09RevD.01
frameworkgroup: C1[X(C6H4N4O3S)]
method: RPBEPBE
basis: SDD
operation: Freq
keyword: #p
keyword: freq=noraman
keyword: PBEPBE/SDD
title: #p freq=noraman PBEPBE/SDD
converged: NO NO NO NO
title: Mulliken charges:
elementType: S O O O N N N N C C C C C C H H H H
charge: 0.334228 -0.114902 -0.204514 -0.214690 -0.170607 0.014920 -0.018124 0.090777 -0.399324 -0.104484 0.129683 -0.183486 -0.069285 -0.224144 0.279395 0.279388 0.268972 0.306198
chargesum: 0.00000
title: Mulliken charges with hydrogens summed into heavy atoms:
elementType: S O O O N N N N C C C C C C
charge: 0.334228 -0.114902 -0.204514 -0.214690 -0.170607 0.014920 -0.018124 0.090777 0.159459 -0.104484 0.129683 0.085487 -0.069285 0.082054
polarizability: 2.15904485e+02 -2.06188052e+00 1.33370384e+02 -7.48940347e-03 -5.15800122e-03 4.79259717e+01
1716.lowfreq: -16.1704 -8.4097 -6.4552 -0.0015 -0.0015 0.0013 22.0237 55.5167 86.9293
frequency: 22.0147 55.5096 86.9278 97.0442 127.7923 182.2318 211.3527 246.0830 301.7330 329.4433 382.6200 429.3094 485.2906 488.3082 509.8526 600.6459 602.0839 673.7676 683.6318 684.9462 708.7562 727.4962 796.0393 816.6183 828.5257 890.7452 937.3615 976.7268 1008.1603 1057.1973 1123.8158 1136.7410 1158.3844 1221.5909 1256.6237 1288.2882 1298.7755 1330.2526 1348.1249 1443.6488 1472.6938 1528.9994 1565.6975 1714.9584 2982.8992 3036.1099 3172.7032 3217.6180
redmass: 8.4392 10.1646 13.6189 9.3385 5.7113 10.8976 5.3791 11.3166 9.2225 15.1891 2.5197 13.1345 4.1106 9.7676 8.7762 7.5467 12.6178 11.3497 7.3826 3.4321 9.1828 13.7053 7.2443 8.7816 1.4826 1.4291 3.3965 3.8054 1.7965 10.4768 2.7054 7.8500 1.1019 9.1909 1.7609 1.4512 2.0476 5.2422 12.3205 1.1113 6.8683 10.7430 7.3560 12.9293 1.0582 1.1035 1.0971 1.0964
irintensity: 5.9029 0.8399 0.1955 7.1145 0.1064 0.3138 7.8007 1.3656 0.3017 1.8583 1.0671 1.7027 5.6787 0.1110 8.5581 6.8105 7.2104 12.3404 15.6609 2.4838 1.4021 10.4670 118.3615 17.3490 23.1303 19.0472 91.9613 221.4586 5.1243 25.7265 179.8347 118.9648 0.0130 399.2724 4.4431 29.2688 12.5112 91.0182 121.4062 72.1826 329.7592 571.4376 79.4099 280.5423 5.8279 3.3568 3.8411 5.5994
temp: 298.150 k
press: 1.00000 atm
elementType: 16 8 8 8 7 7 7 7 6 6 6 6 6 6 1 1 1 1
symmnumber: 1
zpe: 282594.7 jmol-1
zpe.correction: 0.107635 hartree
zpe.thermalcorrener: 0.119569 hartree
zpe.thermalcorrenthalpy: 0.120514 hartree
zpe.thermalcorrgfe: 0.067368 hartree
zpe.sumelectzpe: -1072.645537 hartree
zpe.sumelectthermal: -1072.633602 hartree
zpe.sumelectthermalent: -1072.632658 hartree
zpe.sumelectthermalfe: -1072.685803 hartree
dipole: -3.9438 -5.1940 0.0037
dipole: 6.5216
quadrupole: -114.2486 -87.8629 -84.2750
quadrupole: 23.2436 0.0023 0.0008
quadrupole: -18.7864 7.5993 11.1871 23.2436 0.0023 0.0008
hfenergy: -1072.7531712 hartree
pointgroup: C01 [X(C6H4N4O3S1)]
dipole: 1.5539468 -2.0417056 -0.0014678 debye
dipolederiv: -0.1318264 -0.0615726 -0.0000283 -0.3022772 -0.3241424 0.0000365 -0.0000214 0.0000448 0.1477848 -0.48471 0.0300178 0.0000061 -0.669215 -0.9324098 -0.0001887 -0.000283 -0.0002747 -0.2769707 -0.9875839 0.1825268 -0.0000666 0.4057306 -0.5469296 0.0002283 0.0006345 -0.00031 -0.2274385 -0.6729374 -0.1364675 0.0000212 -0.3433713 -0.6998692 -0.0001909 0.0003713 0.0003919 -0.2363915 -2.671713 -0.0316298 -0.0001155 -0.2589958 -0.5904068 -0.0001326 -0.0004771 -0.000084 -0.1762384 -1.1352738 0.117298 0.0000674 0.8003123 -0.6137514 0.0000212 0.0001239 0.0000612 -0.1826114 -0.4936213 0.1726269 0.0000584 0.2367091 -0.6950805 -0.000133 -0.000008 -0.0000906 -0.220015 2.2570847 0.0957238 -0.000196 0.2614901 1.0443749 -0.0001125 -0.0006533 -0.0000313 0.2395877 -0.1830264 -0.2465029 -0.0001575 -0.4623099 0.1840645 -0.000028 -0.000043 -0.0000568 0.3583751 2.067579 0.0524526 0.0000241 -0.7427681 0.7158969 -0.0000674 0.0000275 -0.0001055 0.054197 1.9584457 -0.0299126 0.0000997 1.202887 1.5225673 0.0004088 0.0006129 0.0003953 0.2944891 0.3561787 0.1352303 0.0001105 0.1047746 0.4886701 0.0001506 0.0000788 0.0001431 -0.0449458 -1.0339403 -0.2822207 0.0002232 -0.8089321 0.0447249 0.0000885 -0.0001948 -0.0000601 -0.0865443 0.8941764 0.0530271 -0.0000463 0.3583396 0.1870343 -0.0000661 -0.0002067 -0.0000189 0.009681 0.0637623 -0.0564259 -0.0308712 0.0526703 0.0424684 -0.0409222 -0.0362801 -0.0573377 0.0132938 0.0637769 -0.0564786 0.0308688 0.0526258 0.0424422 0.040921 0.0363186 0.0573227 0.0133686 0.0378557 0.0591721 0.0000002 0.0656403 0.0217172 -0.0000206 -0.0000123 -0.0000053 0.1328995 0.0957731 0.0031351 0.0000019 0.04669 0.1086289 0.000007 0.0000121 0.0000159 0.187479 unknown
polarizability: 215.8996853|2.1558012|133.3751835|-0.0074953|0.0051495|47.9259717 unknown
InChI: InChI=1S/C6H4N4O3S/c11-5-7-1-2-9(5)6-8-3-4(14-6)10(12)13/h1,3H,2H2
charge 0 multiplicity 1
18 atoms
S  -1.000878 -1.256117 -0.000104
O  2.692288 1.93774 0.000746
O  -4.440459 0.801516 0.000596
O  -3.979984 -1.451712 0.000688
N  1.605223 -0.222966 -0.000139
N  -0.230267 1.344813 -0.000304
N  3.954534 -0.120748 0.000294
N  -3.623784 -0.202997 -0.000366
C  2.089205 -1.610975 -0.000372
C  0.265675 0.108764 -0.000209
C  2.736903 0.706372 0.000244
C  3.590252 -1.37669 -0.000112
C  -2.217748 0.084384 -0.000291
C  -1.613289 1.337309 -0.000299
H  1.759899 -2.168893 -0.898983
H  1.759664 -2.169284 0.897908
H  4.320156 -2.191941 -0.000191
H  -2.164689 2.277726 -0.000404
