program: Orca
programVersion: 5.0.2
elementType: S S P O O O O C C C C C C C C C C C C H H H H H H H H H H H H H H H H H
charge: 0
multiplicity: 1
keywords: wb97x-d3
keywords: def2-TZVPP
keywords: def2/J RIJCOSX
keywords: DEFGRID2
keywords: scfconv7
keywords: smallprint printgap noloewdin
keywords: NOSOSCF
formula: C12H17O4PS2
InChI: InChI=1/C12H17O4PS2/c1-4-16-12(13)11(10-8-6-5-7-9-10)19-17(18,14-2)15-3/h5-9,11H,4H2,1-3H3
36 atoms
S  1.298244 -0.476115 0.647146
S  1.509596 1.410329 -2.198743
P  1.757069 1.338965 -0.29605
O  -1.424932 -2.80782 -0.721013
O  3.241502 1.546954 0.271297
O  0.947956 2.491381 0.448419
O  -0.303915 -2.784774 1.220792
C  -0.28047 -0.846856 -0.203933
C  -1.389555 0.102815 0.175054
C  -0.651933 -2.263018 0.193113
C  -2.075984 0.791806 -0.8177
C  -1.741735 0.29249 1.509593
C  -3.099549 1.668523 -0.481044
C  -2.762458 1.167852 1.843435
C  -3.443272 1.85964 0.848631
C  -1.925007 -4.142404 -0.500773
C  -0.894177 -5.19706 -0.829293
C  4.359768 0.887787 -0.329736
C  1.003125 2.697425 1.864086
H  -0.106414 -0.804711 -1.28132
H  -1.807016 0.650144 -1.856977
H  -1.212509 -0.235016 2.293988
H  -3.624522 2.204935 -1.260963
H  -3.027244 1.311291 2.883102
H  -4.237549 2.546349 1.111751
H  -2.288196 -4.238706 0.523258
H  -2.780922 -4.220052 -1.168439
H  -0.049943 -5.182477 -0.1412
H  -1.362022 -6.179835 -0.757975
H  -0.518205 -5.08261 -1.846223
H  4.273467 -0.197256 -0.253622
H  5.242438 1.211378 0.2160
H  4.462407 1.167824 -1.378168
H  0.139024 3.303154 2.125413
H  1.912684 3.231072 2.138366
H  0.954041 1.757367 2.415291
elementType: S P O C H
totalener: -1906.37060148 hartree
nucrepener: 2016.34184174 hartree
electener: -3922.71244322 hartree
oneelecener: -6633.76242027 hartree
twoeener: 2711.04997705 hartree
cpcmener: -0.02494650 hartree
kineticenergy: 1900.95230557 hartree
xcener: -128.466752361364 hartree
chargesum: -0.0000000
charge: -0.164627 -0.429317 0.659738 -0.277973 -0.348408 -0.330629 -0.433443 0.120945 0.014502 0.388479 -0.182806 -0.192726 -0.151327 -0.166001 -0.145636 0.030181 -0.251661 -0.110213 -0.130662 0.129851 0.137808 0.139957 0.157424 0.158037 0.158610 0.095881 0.111289 0.090724 0.096773 0.089639 0.112736 0.128800 0.113160 0.129218 0.135992 0.115683
qa: -0.1646 -0.4293 0.6597 -0.2780 -0.3484 -0.3306 -0.4334 0.1209 0.0145 0.3885 -0.1828 -0.1927 -0.1513 -0.1660 -0.1456 0.0302 -0.2517 -0.1102 -0.1307 0.1299 0.1378 0.1400 0.1574 0.1580 0.1586 0.0959 0.1113 0.0907 0.0968 0.0896 0.1127 0.1288 0.1132 0.1292 0.1360 0.1157
va: 2.3131 2.0404 5.4172 2.1667 2.0849 2.0977 2.0630 3.8174 3.3602 4.2254 3.9843 3.9229 3.9197 3.9295 3.9003 3.8534 3.9160 3.8513 3.8422 1.0572 1.0124 1.0222 0.9912 0.9912 0.9891 1.0075 0.9957 1.0124 1.0066 1.0042 0.9926 0.9907 1.0006 0.9869 0.9947 0.9963
dispcorr: -0.018846728 hartree
energy: -1906.389448210367
dipole: -6.56128 6.11597 -0.44530 -9.55263 9.02075 -0.53189 3.68409 -2.92929 0.75480
magnitude: 1.02515 au
magnitude: 2.60571 debye
