program: Orca
programVersion: 5.0.2
elementType: S S P O O O O C C C C C C C C C C C C H H H H H H H H H H H H H H H H H
charge: 0
multiplicity: 1
keywords: wb97x-d3
keywords: def2-TZVPP
keywords: def2/J RIJCOSX
keywords: DEFGRID2
keywords: scfconv7
keywords: smallprint printgap noloewdin
keywords: NOSOSCF
formula: C12H17O4PS2
InChI: InChI=1/C12H17O4PS2/c1-4-16-12(13)11(10-8-6-5-7-9-10)19-17(18,14-2)15-3/h5-9,11H,4H2,1-3H3
36 atoms
S  1.282835 -0.475208 0.653189
S  1.461327 1.395911 -2.203335
P  1.72581 1.33834 -0.302048
O  -1.421732 -2.817187 -0.725718
O  3.215156 1.558704 0.245669
O  0.916747 2.491103 0.440426
O  -0.353305 -2.778829 1.245746
C  -0.295527 -0.852697 -0.195579
C  -1.398817 0.106222 0.175962
C  -0.673669 -2.26528 0.204972
C  -2.059277 0.813526 -0.821378
C  -1.761692 0.297499 1.507436
C  -3.064626 1.713614 -0.492194
C  -2.765242 1.19534 1.833799
C  -3.417297 1.908348 0.834559
C  -1.941449 -4.143983 -0.507592
C  -0.912207 -5.214094 -0.786523
C  4.324743 0.880337 -0.351008
C  0.967025 2.705487 1.854909
H  -0.118804 -0.816171 -1.272476
H  -1.780652 0.670426 -1.85782
H  -1.252735 -0.244199 2.29558
H  -3.566897 2.266422 -1.275574
H  -3.038094 1.340976 2.871094
H  -4.196062 2.614734 1.091941
H  -2.342985 -4.22408 0.503549
H  -2.773634 -4.221117 -1.205155
H  -1.393865 -6.190454 -0.719147
H  -0.499673 -5.117306 -1.791194
H  -0.092157 -5.200387 -0.069549
H  4.359975 1.054403 -1.426884
H  4.281681 -0.193217 -0.161308
H  5.223175 1.286462 0.106771
H  0.104357 3.316563 2.108645
H  1.877356 3.237556 2.129774
H  0.911716 1.769072 2.411482
elementType: S P O C H
totalener: -1906.37031749 hartree
nucrepener: 2018.60576917 hartree
electener: -3924.97608666 hartree
oneelecener: -6638.28400317 hartree
twoeener: 2713.30791651 hartree
cpcmener: -0.02479136 hartree
kineticenergy: 1900.95553420 hartree
xcener: -128.467686625856 hartree
chargesum: 0.0000000
charge: -0.166116 -0.429932 0.662434 -0.277731 -0.349242 -0.329589 -0.433970 0.119870 0.014800 0.390587 -0.181646 -0.193340 -0.151869 -0.166227 -0.145376 0.029637 -0.251335 -0.109099 -0.131703 0.130112 0.137198 0.139214 0.157182 0.158009 0.158480 0.096203 0.111146 0.096821 0.089495 0.090513 0.110992 0.114196 0.128310 0.129473 0.136722 0.115778
qa: -0.1661 -0.4299 0.6624 -0.2777 -0.3492 -0.3296 -0.4340 0.1199 0.0148 0.3906 -0.1816 -0.1933 -0.1519 -0.1662 -0.1454 0.0296 -0.2513 -0.1091 -0.1317 0.1301 0.1372 0.1392 0.1572 0.1580 0.1585 0.0962 0.1111 0.0968 0.0895 0.0905 0.1110 0.1142 0.1283 0.1295 0.1367 0.1158
va: 2.3116 2.0396 5.4176 2.1651 2.0876 2.0995 2.0632 3.8165 3.3623 4.2215 3.9797 3.9248 3.9215 3.9284 3.9000 3.8542 3.9152 3.8515 3.8426 1.0581 1.0128 1.0233 0.9913 0.9913 0.9891 1.0071 0.9956 1.0066 1.0041 1.0126 1.0019 0.9917 0.9907 0.9867 0.9946 0.9959
dispcorr: -0.018939756 hartree
energy: -1906.389257241338
dipole: -6.49661 6.08109 -0.41552 -9.51193 8.99969 -0.51224 3.69367 -2.94960 0.74406
magnitude: 0.99432 au
magnitude: 2.52737 debye
