program: Orca
programVersion: 5.0.2
elementType: S S P O O O O C C C C C C C C C C C C H H H H H H H H H H H H H H H H H
charge: 0
multiplicity: 1
keywords: wb97x-d3
keywords: def2-TZVPP
keywords: def2/J RIJCOSX
keywords: DEFGRID2
keywords: scfconv7
keywords: smallprint printgap noloewdin
keywords: NOSOSCF
formula: C12H17O4PS2
InChI: InChI=1/C12H17O4PS2/c1-4-16-12(13)11(10-8-6-5-7-9-10)19-17(18,14-2)15-3/h5-9,11H,4H2,1-3H3
36 atoms
S  1.226807 -0.671874 0.051841
S  1.395333 2.228383 -1.748442
P  1.700294 1.368363 -0.058321
O  -0.428629 -2.908306 -0.196574
O  3.204619 1.313825 0.489523
O  0.940562 2.109379 1.129508
O  -1.612162 -2.290045 -1.995095
C  -0.39531 -0.626047 -0.801985
C  -1.443418 0.118602 -0.011895
C  -0.874597 -2.038965 -1.078579
C  -2.121834 1.175143 -0.6072
C  -1.745195 -0.236153 1.301186
C  -3.089588 1.875023 0.101707
C  -2.711558 0.462877 2.006527
C  -3.385345 1.521549 1.409169
C  -0.885992 -4.274175 -0.272876
C  -2.246161 -4.441895 0.360618
C  4.287356 0.914608 -0.356206
C  1.069836 1.713333 2.500097
H  -0.249489 -0.141451 -1.769569
H  -1.889019 1.458656 -1.625738
H  -1.218249 -1.049933 1.784383
H  -3.607807 2.700221 -0.369412
H  -2.937326 0.182577 3.02736
H  -4.135516 2.069557 1.964677
H  -0.87699 -4.612583 -1.309582
H  -0.132355 -4.840014 0.271471
H  -3.026206 -3.911865 -0.185048
H  -2.505684 -5.501131 0.36356
H  -2.247623 -4.09698 1.394903
H  4.242976 -0.152773 -0.575963
H  5.20477 1.128057 0.186173
H  4.285181 1.475464 -1.291343
H  1.994917 2.102188 2.924642
H  1.045025 0.628977 2.61616
H  0.223552 2.142547 3.030433
elementType: S P O C H
totalener: -1906.36927246 hartree
nucrepener: 2030.53436336 hartree
electener: -3936.90363582 hartree
oneelecener: -6661.87718541 hartree
twoeener: 2724.97354959 hartree
cpcmener: -0.02641787 hartree
kineticenergy: 1900.95715831 hartree
xcener: -128.467635837080 hartree
chargesum: -0.0000000
charge: -0.172507 -0.427680 0.661522 -0.273564 -0.347642 -0.330032 -0.435616 0.134219 0.038349 0.385739 -0.194078 -0.216590 -0.144954 -0.161447 -0.148802 0.025350 -0.254177 -0.108936 -0.130935 0.128930 0.135236 0.139528 0.157193 0.157161 0.158515 0.097843 0.110056 0.093045 0.102541 0.088846 0.114991 0.128327 0.109458 0.135750 0.115512 0.128850
qa: -0.1725 -0.4277 0.6615 -0.2736 -0.3476 -0.3300 -0.4356 0.1342 0.0383 0.3857 -0.1941 -0.2166 -0.1450 -0.1614 -0.1488 0.0253 -0.2542 -0.1089 -0.1309 0.1289 0.1352 0.1395 0.1572 0.1572 0.1585 0.0978 0.1101 0.0930 0.1025 0.0888 0.1150 0.1283 0.1095 0.1358 0.1155 0.1288
va: 2.3029 2.0433 5.4166 2.1422 2.0890 2.0976 2.0731 3.7833 3.3741 4.2310 4.0022 3.9097 3.9187 3.9211 3.9044 3.8555 3.9167 3.8529 3.8452 1.0542 1.0140 1.0216 0.9912 0.9916 0.9891 1.0095 0.9952 1.0118 1.0079 1.0041 0.9909 0.9904 1.0024 0.9954 0.9960 0.9869
dispcorr: -0.019630564 hartree
energy: -1906.388903025230
dipole: -7.12138 7.72808 0.60669 -11.41177 9.97250 -1.43927 9.89324 -7.58509 2.30815
magnitude: 2.78696 au
magnitude: 7.08388 debye
