program: Orca
programVersion: 5.0.2
elementType: S S P O O O O C C C C C C C C C C C C H H H H H H H H H H H H H H H H H
charge: 0
multiplicity: 1
keywords: wb97x-d3
keywords: def2-TZVPP
keywords: def2/J RIJCOSX
keywords: DEFGRID2
keywords: scfconv7
keywords: smallprint printgap noloewdin
keywords: NOSOSCF
formula: C12H17O4PS2
InChI: InChI=1/C12H17O4PS2/c1-4-16-12(13)11(10-8-6-5-7-9-10)19-17(18,14-2)15-3/h5-9,11H,4H2,1-3H3
36 atoms
S  0.4484 0.078828 1.07398
S  1.816388 0.760446 -1.980842
P  2.074479 0.759764 -0.073743
O  -0.225046 -2.606088 0.028352
O  3.317963 -0.064384 0.495864
O  2.457796 2.146369 0.617856
O  -2.405869 -2.141413 -0.03477
C  -0.825027 -0.33794 -0.177027
C  -1.971532 0.62673 -0.116877
C  -1.255328 -1.789709 -0.033612
C  -2.785438 0.718778 1.010799
C  -2.214768 1.464889 -1.198147
C  -3.824864 1.633458 1.049752
C  -3.25894 2.380797 -1.16029
C  -4.066532 2.465729 -0.03741
C  -0.490388 -4.020733 0.093611
C  0.833294 -4.735801 0.168084
C  3.429972 -1.460305 0.204845
C  1.624199 3.29129 0.420262
H  -0.333389 -0.260851 -1.15576
H  -2.610371 0.07835 1.867483
H  -1.586127 1.404049 -2.078365
H  -4.452098 1.695885 1.929658
H  -3.437858 3.026295 -2.010483
H  -4.880887 3.178196 -0.00516
H  -1.101418 -4.235746 0.97234
H  -1.050159 -4.325602 -0.79287
H  0.652079 -5.810539 0.196814
H  1.455206 -4.527897 -0.702977
H  1.388115 -4.470415 1.068495
H  2.605233 -2.020889 0.647269
H  4.365031 -1.796554 0.644915
H  3.453451 -1.641221 -0.870467
H  2.069887 4.101513 0.991219
H  0.612097 3.112741 0.787772
H  1.582861 3.572344 -0.63236
elementType: S P O C H
totalener: -1906.36877218 hartree
nucrepener: 2002.39351051 hartree
electener: -3908.76228269 hartree
oneelecener: -6605.25345105 hartree
twoeener: 2696.49116835 hartree
cpcmener: -0.02545808 hartree
kineticenergy: 1900.95587706 hartree
xcener: -128.465664710488 hartree
chargesum: 0.0000000
charge: -0.161958 -0.428654 0.665375 -0.266827 -0.334215 -0.331604 -0.429023 0.123623 0.063880 0.369763 -0.221513 -0.205891 -0.139928 -0.151519 -0.165684 0.038444 -0.269954 -0.098763 -0.113448 0.133778 0.136844 0.134129 0.157059 0.156804 0.157654 0.098346 0.100440 0.100762 0.091891 0.091590 0.096664 0.130506 0.113225 0.131787 0.110524 0.115893
qa: -0.1620 -0.4287 0.6654 -0.2668 -0.3342 -0.3316 -0.4290 0.1236 0.0639 0.3698 -0.2215 -0.2059 -0.1399 -0.1515 -0.1657 0.0384 -0.2700 -0.0988 -0.1134 0.1338 0.1368 0.1341 0.1571 0.1568 0.1577 0.0983 0.1004 0.1008 0.0919 0.0916 0.0967 0.1305 0.1132 0.1318 0.1105 0.1159
va: 2.2968 2.0313 5.3922 2.1530 2.1174 2.1129 2.0779 3.6803 3.4987 4.2351 3.9939 3.9626 3.9088 3.9184 3.9115 3.8461 3.9617 3.8620 3.8532 1.0735 1.0116 1.0135 0.9913 0.9920 0.9903 0.9954 0.9955 1.0081 1.0019 0.9997 0.9975 0.9933 0.9981 0.9927 0.9920 0.9974
dispcorr: -0.018178325 hartree
energy: -1906.386950504736
dipole: -3.44194 3.76823 0.32629 -9.18904 8.63400 -0.55503 1.38715 -0.81766 0.56949
magnitude: 0.85956 au
magnitude: 2.18484 debye
