program: Orca
programVersion: 5.0.2
elementType: S S P O O O O C C C C C C C C C C C C H H H H H H H H H H H H H H H H H
charge: 0
multiplicity: 1
keywords: wb97x-d3
keywords: def2-TZVPP
keywords: def2/J RIJCOSX
keywords: DEFGRID2
keywords: scfconv7
keywords: smallprint printgap noloewdin
keywords: NOSOSCF
formula: C12H17O4PS2
InChI: InChI=1/C12H17O4PS2/c1-4-16-12(13)11(10-8-6-5-7-9-10)19-17(18,14-2)15-3/h5-9,11H,4H2,1-3H3
36 atoms
S  0.964961 -0.934874 0.507179
S  3.633195 0.778278 1.351707
P  2.142761 0.732019 0.139063
O  -1.152197 -2.735817 0.213533
O  1.177367 2.010773 0.141749
O  2.455689 0.606912 -1.423005
O  -1.571137 -2.368132 -1.957278
C  -0.409396 -0.701102 -0.698774
C  -1.434986 0.316312 -0.262673
C  -1.100042 -2.037384 -0.901353
C  -1.815547 1.315567 -1.151532
C  -2.033236 0.257673 0.993329
C  -2.774776 2.251284 -0.789311
C  -2.991655 1.192283 1.353838
C  -3.364735 2.192111 0.464795
C  -1.88646 -3.976431 0.231971
C  -3.366128 -3.740914 0.417182
C  0.709081 2.563581 1.373597
C  3.229016 1.61464 -2.090302
H  0.015121 -0.410528 -1.659703
H  -1.353897 1.368679 -2.130051
H  -1.743277 -0.504887 1.705173
H  -3.056635 3.028665 -1.487828
H  -3.448149 1.140101 2.333901
H  -4.11078 2.922688 0.750073
H  -1.67697 -4.547622 -0.673102
H  -1.471201 -4.521861 1.077355
H  -3.865479 -4.704557 0.52552
H  -3.567009 -3.160234 1.31797
H  -3.814424 -3.229931 -0.434515
H  1.526009 3.032589 1.922502
H  0.24288 1.805875 2.004924
H  -0.031644 3.317326 1.118896
H  4.115106 1.884174 -1.513649
H  2.629121 2.505603 -2.273591
H  3.541873 1.189872 -3.040687
elementType: S P O C H
totalener: -1906.37043061 hartree
nucrepener: 2018.05938189 hartree
electener: -3924.42981250 hartree
oneelecener: -6636.42410772 hartree
twoeener: 2711.99429521 hartree
cpcmener: -0.02555627 hartree
kineticenergy: 1900.95112595 hartree
xcener: -128.464786318399 hartree
chargesum: 0.0000000
charge: -0.146000 -0.436213 0.618948 -0.274487 -0.320515 -0.336753 -0.433054 0.146410 0.040338 0.381290 -0.208798 -0.252859 -0.127508 -0.120518 -0.177112 0.023951 -0.253200 -0.129866 -0.107244 0.133414 0.139954 0.137658 0.157466 0.157660 0.158117 0.098368 0.110056 0.103053 0.088528 0.092908 0.134329 0.115397 0.130693 0.105753 0.122941 0.126894
qa: -0.1460 -0.4362 0.6189 -0.2745 -0.3205 -0.3368 -0.4331 0.1464 0.0403 0.3813 -0.2088 -0.2529 -0.1275 -0.1205 -0.1771 0.0240 -0.2532 -0.1299 -0.1072 0.1334 0.1400 0.1377 0.1575 0.1577 0.1581 0.0984 0.1101 0.1031 0.0885 0.0929 0.1343 0.1154 0.1307 0.1058 0.1229 0.1269
va: 2.3339 2.0376 5.4362 2.1359 2.0560 2.0866 2.0751 3.7501 3.4564 4.2404 3.9882 3.9221 3.8708 3.8956 3.9228 3.8567 3.9174 3.8411 3.8458 1.0450 1.0060 1.0243 0.9910 0.9907 0.9906 1.0095 0.9952 1.0079 1.0043 1.0111 1.0078 0.9879 0.9883 1.0040 0.9918 0.9893
dispcorr: -0.019805666 hartree
energy: -1906.390236277636
dipole: -17.34921 15.65109 -1.69811 0.64335 0.20258 0.84593 -0.76057 0.79214 0.03157
magnitude: 1.89741 au
magnitude: 4.82284 debye
