program: Orca
programVersion: 5.0.2
elementType: S S P O O O O C C C C C C C C C C C C H H H H H H H H H H H H H H H H H
charge: 0
multiplicity: 1
keywords: wb97x-d3
keywords: def2-TZVPP
keywords: def2/J RIJCOSX
keywords: DEFGRID2
keywords: scfconv7
keywords: smallprint printgap noloewdin
keywords: NOSOSCF
formula: C12H17O4PS2
InChI: InChI=1/C12H17O4PS2/c1-4-16-12(13)11(10-8-6-5-7-9-10)19-17(18,14-2)15-3/h5-9,11H,4H2,1-3H3
36 atoms
S  0.145516 1.240726 0.851799
S  3.3883 1.682501 1.279325
P  2.069289 0.742943 0.246871
O  -0.628896 -1.95923 -1.069882
O  2.010752 1.016862 -1.326273
O  2.160251 -0.860825 0.264608
O  -0.754123 -1.739461 1.150024
C  -0.895555 0.214591 -0.259212
C  -2.33177 0.632377 -0.05482
C  -0.739037 -1.266003 0.043699
C  -2.954842 0.510973 1.185893
C  -3.051204 1.13486 -1.134002
C  -4.283168 0.878729 1.335438
C  -4.381753 1.499178 -0.981667
C  -5.001244 1.369364 0.25259
C  -0.506548 -3.390667 -0.965461
C  -0.373552 -3.942116 -2.360575
C  3.161645 0.762688 -2.145058
C  2.480408 -1.555256 1.474301
H  -0.607632 0.418298 -1.289624
H  -2.412064 0.128574 2.040846
H  -2.57115 1.23863 -2.099395
H  -4.759008 0.779374 2.302442
H  -4.932587 1.884533 -1.829861
H  -6.039009 1.652489 0.372772
H  0.369454 -3.636285 -0.362303
H  -1.388543 -3.794129 -0.464893
H  -0.277163 -5.026453 -2.304744
H  -1.248958 -3.717737 -2.969938
H  0.512343 -3.555385 -2.864386
H  4.062247 1.196843 -1.708777
H  2.970271 1.23407 -3.105651
H  3.306872 -0.307435 -2.291144
H  2.423007 -2.61624 1.248194
H  1.776762 -1.320298 2.272644
H  3.489861 -1.310432 1.802477
elementType: S P O C H
totalener: -1906.37373884 hartree
nucrepener: 2002.99525118 hartree
electener: -3909.36899002 hartree
oneelecener: -6606.64257692 hartree
twoeener: 2697.27358690 hartree
cpcmener: -0.02577369 hartree
kineticenergy: 1900.94312863 hartree
xcener: -128.461721104548 hartree
chargesum: 0.0000000
charge: -0.130469 -0.430755 0.618474 -0.266273 -0.334165 -0.332692 -0.433113 0.164234 0.008158 0.334776 -0.202510 -0.171650 -0.163876 -0.149385 -0.152679 0.041035 -0.249562 -0.109512 -0.119398 0.114862 0.143456 0.143457 0.158208 0.158347 0.159068 0.097569 0.102359 0.089981 0.089365 0.089222 0.107023 0.127419 0.123722 0.130471 0.119291 0.125542
qa: -0.1305 -0.4308 0.6185 -0.2663 -0.3342 -0.3327 -0.4331 0.1642 0.0082 0.3348 -0.2025 -0.1716 -0.1639 -0.1494 -0.1527 0.0410 -0.2496 -0.1095 -0.1194 0.1149 0.1435 0.1435 0.1582 0.1583 0.1591 0.0976 0.1024 0.0900 0.0894 0.0892 0.1070 0.1274 0.1237 0.1305 0.1193 0.1255
va: 2.3205 2.0406 5.4280 2.1504 2.0878 2.0510 2.0624 3.7708 3.6141 4.2254 3.9792 3.9529 3.9491 3.8958 3.9074 3.8419 3.9717 3.8469 3.8266 1.0516 1.0291 1.0028 0.9919 0.9916 0.9898 0.9923 0.9972 1.0067 1.0033 1.0032 1.0029 0.9892 0.9917 0.9875 0.9950 1.0078
dispcorr: -0.017940558 hartree
energy: -1906.391679397835
dipole: -6.43126 5.70436 -0.72690 -16.76662 14.91374 -1.85289 -11.11477 9.02697 -2.08779
magnitude: 2.88452 au
magnitude: 7.33187 debye
