program: Orca
programVersion: 5.0.2
elementType: S S P O O O O C C C C C C C C C C C C H H H H H H H H H H H H H H H H H
charge: 0
multiplicity: 1
keywords: wb97x-d3
keywords: def2-TZVPP
keywords: def2/J RIJCOSX
keywords: DEFGRID2
keywords: scfconv7
keywords: smallprint printgap noloewdin
keywords: NOSOSCF
formula: C12H17O4PS2
InChI: InChI=1/C12H17O4PS2/c1-4-16-12(13)11(10-8-6-5-7-9-10)19-17(18,14-2)15-3/h5-9,11H,4H2,1-3H3
36 atoms
S  0.781924 -0.706329 0.823955
S  1.730943 0.968476 -1.999434
P  1.807137 0.877752 -0.07755
O  -0.5995 -3.145609 -0.239597
O  3.205947 0.529076 0.609159
O  1.410013 2.223506 0.689409
O  -2.483848 -2.219211 0.522007
C  -0.695517 -0.802926 -0.263569
C  -1.620434 0.368056 -0.120597
C  -1.376621 -2.127397 0.06301
C  -2.097527 0.777224 1.122397
C  -2.021462 1.05382 -1.261127
C  -2.970924 1.848316 1.216851
C  -2.893492 2.130851 -1.166341
C  -3.371431 2.529102 0.072264
C  -1.094161 -4.476003 0.010952
C  -0.050334 -5.44974 -0.470112
C  4.345616 1.374219 0.406276
C  0.532835 3.229347 0.180498
H  -0.326434 -0.86701 -1.292302
H  -1.782983 0.26481 2.023326
H  -1.64984 0.746781 -2.230921
H  -3.339282 2.155918 2.187061
H  -3.194388 2.657778 -2.062687
H  -4.050339 3.368713 0.149529
H  -1.282357 -4.595059 1.079859
H  -2.03743 -4.619681 -0.519349
H  0.128758 -5.352662 -1.541247
H  0.896278 -5.321499 0.055533
H  -0.40012 -6.465097 -0.282725
H  4.213298 2.338658 0.896495
H  4.538646 1.528201 -0.65614
H  5.194582 0.860907 0.850352
H  0.882779 4.182378 0.572194
H  -0.483636 3.050996 0.528097
H  0.547982 3.266103 -0.90862
elementType: S P O C H
totalener: -1906.36809587 hartree
nucrepener: 2008.85519508 hartree
electener: -3915.22329096 hartree
oneelecener: -6618.67724940 hartree
twoeener: 2703.45395845 hartree
cpcmener: -0.02480894 hartree
kineticenergy: 1900.95588408 hartree
xcener: -128.467577960458 hartree
chargesum: -0.0000000
charge: -0.144204 -0.438006 0.657961 -0.268338 -0.340817 -0.332335 -0.421313 0.105486 0.025609 0.363605 -0.178098 -0.190731 -0.151780 -0.158918 -0.148991 0.039010 -0.247127 -0.117486 -0.089955 0.133820 0.129911 0.132011 0.154231 0.156748 0.157385 0.101449 0.098561 0.089134 0.088605 0.088646 0.123842 0.107447 0.127888 0.132802 0.103491 0.110457
qa: -0.1442 -0.4380 0.6580 -0.2683 -0.3408 -0.3323 -0.4213 0.1055 0.0256 0.3636 -0.1781 -0.1907 -0.1518 -0.1589 -0.1490 0.0390 -0.2471 -0.1175 -0.0900 0.1338 0.1299 0.1320 0.1542 0.1567 0.1574 0.1014 0.0986 0.0891 0.0886 0.0886 0.1238 0.1074 0.1279 0.1328 0.1035 0.1105
va: 2.3109 2.0153 5.4069 2.1624 2.1229 2.0868 2.0827 3.7554 3.3850 4.2516 3.9385 3.9486 3.9209 3.9154 3.8852 3.8386 3.9726 3.8569 3.8397 1.0573 1.0235 1.0164 0.9933 0.9923 0.9906 0.9949 0.9960 1.0031 1.0034 1.0068 0.9906 0.9989 0.9885 0.9942 0.9835 1.0104
dispcorr: -0.018902414 hartree
energy: -1906.386998288853
dipole: -3.62907 4.09345 0.46439 -3.28984 3.83790 0.54805 -0.08552 0.27109 0.18557
magnitude: 0.74192 au
magnitude: 1.88582 debye
