program: Orca
programVersion: 5.0.2
elementType: S S P O O O O C C C C C C C C C C C C H H H H H H H H H H H H H H H H H
charge: 0
multiplicity: 1
keywords: wb97x-d3
keywords: def2-TZVPP
keywords: def2/J RIJCOSX
keywords: DEFGRID2
keywords: scfconv7
keywords: smallprint printgap noloewdin
keywords: NOSOSCF
formula: C12H17O4PS2
InChI: InChI=1/C12H17O4PS2/c1-4-16-12(13)11(10-8-6-5-7-9-10)19-17(18,14-2)15-3/h5-9,11H,4H2,1-3H3
36 atoms
S  1.358203 -0.388981 1.026777
S  1.978627 1.097172 -1.995062
P  1.843144 1.305912 -0.085217
O  -1.242013 -2.97894 -0.218417
O  3.179389 1.748779 0.681053
O  0.803548 2.392258 0.449505
O  -0.119032 -2.710799 1.698405
C  -0.029561 -1.003723 0.002029
C  -1.196243 -0.04949 -0.039208
C  -0.451389 -2.329366 0.60562
C  -1.804337 0.380694 1.137625
C  -1.663019 0.418855 -1.26077
C  -2.85767 1.278445 1.088929
C  -2.719725 1.319477 -1.308353
C  -3.315487 1.754345 -0.13451
C  -1.786824 -4.242054 0.216597
C  -2.556706 -4.829403 -0.936892
C  4.440259 1.166735 0.33724
C  0.34067 3.472043 -0.369461
H  0.342466 -1.177592 -1.011219
H  -1.44511 0.030016 2.097955
H  -1.193437 0.089383 -2.178863
H  -3.321384 1.611097 2.008549
H  -3.070853 1.683544 -2.265309
H  -4.134227 2.461643 -0.169225
H  -0.973942 -4.902906 0.522974
H  -2.433742 -4.073182 1.079939
H  -3.373753 -4.180333 -1.253063
H  -1.911344 -5.02317 -1.79426
H  -2.989548 -5.780322 -0.625618
H  5.171035 1.578955 1.028556
H  4.724495 1.423665 -0.68324
H  4.425699 0.080606 0.443443
H  1.139519 4.188278 -0.562759
H  -0.452809 3.960727 0.190292
H  -0.057402 3.111292 -1.317091
elementType: S P O C H
totalener: -1906.37036370 hartree
nucrepener: 2020.07134705 hartree
electener: -3926.44171075 hartree
oneelecener: -6641.25652980 hartree
twoeener: 2714.81481905 hartree
cpcmener: -0.02429006 hartree
kineticenergy: 1900.96889310 hartree
xcener: -128.469384650298 hartree
chargesum: -0.0000000
charge: -0.138254 -0.448198 0.661422 -0.272528 -0.355809 -0.328931 -0.427856 0.087743 0.039117 0.385703 -0.163722 -0.207979 -0.158800 -0.141512 -0.158093 0.034281 -0.247981 -0.108801 -0.127501 0.130763 0.135818 0.132105 0.157914 0.156093 0.158148 0.098425 0.104586 0.089586 0.088734 0.089315 0.128907 0.113625 0.111040 0.142738 0.130861 0.109039
qa: -0.1383 -0.4482 0.6614 -0.2725 -0.3558 -0.3289 -0.4279 0.0877 0.0391 0.3857 -0.1637 -0.2080 -0.1588 -0.1415 -0.1581 0.0343 -0.2480 -0.1088 -0.1275 0.1308 0.1358 0.1321 0.1579 0.1561 0.1581 0.0984 0.1046 0.0896 0.0887 0.0893 0.1289 0.1136 0.1110 0.1427 0.1309 0.1090
va: 2.3480 1.9981 5.4071 2.1705 2.0950 2.0819 2.0740 3.8689 3.3374 4.2189 3.9448 3.9580 3.9255 3.8815 3.8946 3.8426 3.9726 3.8479 3.8277 1.0492 1.0214 1.0168 0.9909 0.9918 0.9898 0.9964 0.9942 1.0030 1.0032 1.0068 0.9918 1.0020 0.9935 0.9933 0.9887 0.9976
dispcorr: -0.019045908 hartree
energy: -1906.389409611225
dipole: -12.22096 11.22677 -0.99420 -5.89158 5.95623 0.06465 -3.86266 3.28181 -0.58085
magnitude: 1.15325 au
magnitude: 2.93134 debye
