program: Orca
programVersion: 5.0.2
elementType: S S P O O O O C C C C C C C C C C C C H H H H H H H H H H H H H H H H H
charge: 0
multiplicity: 1
keywords: wb97x-d3
keywords: def2-TZVPP
keywords: def2/J RIJCOSX
keywords: DEFGRID2
keywords: scfconv7
keywords: smallprint printgap noloewdin
keywords: NOSOSCF
formula: C12H17O4PS2
InChI: InChI=1/C12H17O4PS2/c1-4-16-12(13)11(10-8-6-5-7-9-10)19-17(18,14-2)15-3/h5-9,11H,4H2,1-3H3
36 atoms
S  1.082315 -0.869892 0.163412
S  1.715017 2.125722 -1.375723
P  1.723818 1.114181 0.26224
O  -0.849505 -2.876545 -0.330329
O  3.144416 0.917745 0.972669
O  0.853839 1.689061 1.468413
O  -1.562512 -2.13618 -2.31527
C  -0.407328 -0.622907 -0.87986
C  -1.458641 0.210864 -0.190185
C  -0.991757 -1.965944 -1.270396
C  -1.958069 -0.143939 1.060932
C  -1.924198 1.363389 -0.810957
C  -2.907683 0.650989 1.6809
C  -2.873024 2.161994 -0.185458
C  -3.364765 1.808574 1.061647
C  -1.448585 -4.170392 -0.548096
C  -1.256497 -4.983948 0.704549
C  4.311367 0.597818 0.211669
C  0.599886 3.087903 1.629348
H  -0.092364 -0.12792 -1.800014
H  -1.592396 -1.029481 1.565534
H  -1.536725 1.644989 -1.781729
H  -3.28792 0.370616 2.654669
H  -3.222585 3.062061 -0.674542
H  -4.099935 2.43249 1.553348
H  -2.50874 -4.043395 -0.773246
H  -0.970207 -4.646328 -1.40607
H  -0.201461 -5.111439 0.948417
H  -1.76192 -4.533586 1.559194
H  -1.683674 -5.974694 0.548918
H  5.145177 0.585212 0.909499
H  4.499183 1.347611 -0.557588
H  4.224981 -0.38403 -0.256872
H  1.497575 3.612716 1.957719
H  -0.167655 3.173149 2.394792
H  0.236009 3.537538 0.705903
elementType: S P O C H
totalener: -1906.36897762 hartree
nucrepener: 2025.57870155 hartree
electener: -3931.94767916 hartree
oneelecener: -6652.10252715 hartree
twoeener: 2720.15484799 hartree
cpcmener: -0.02440087 hartree
kineticenergy: 1900.97912838 hartree
xcener: -128.469831180959 hartree
chargesum: -0.0000000
charge: -0.151725 -0.443907 0.664025 -0.275588 -0.353818 -0.327170 -0.435315 0.134670 0.015835 0.393273 -0.175513 -0.205827 -0.157776 -0.143679 -0.160198 0.029977 -0.249684 -0.109516 -0.125413 0.128596 0.134145 0.133641 0.157138 0.156834 0.158559 0.099476 0.106198 0.089326 0.089300 0.091227 0.128878 0.112348 0.112323 0.141546 0.127603 0.110207
qa: -0.1517 -0.4439 0.6640 -0.2756 -0.3538 -0.3272 -0.4353 0.1347 0.0158 0.3933 -0.1755 -0.2058 -0.1578 -0.1437 -0.1602 0.0300 -0.2497 -0.1095 -0.1254 0.1286 0.1341 0.1336 0.1571 0.1568 0.1586 0.0995 0.1062 0.0893 0.0893 0.0912 0.1289 0.1123 0.1123 0.1415 0.1276 0.1102
va: 2.3314 2.0057 5.4098 2.1435 2.1002 2.0852 2.0781 3.8030 3.4054 4.2074 3.9466 3.9823 3.9352 3.8952 3.9031 3.8474 3.9721 3.8495 3.8305 1.0507 1.0243 1.0156 0.9917 0.9919 0.9897 0.9975 0.9952 1.0031 1.0022 1.0070 0.9908 1.0030 0.9919 0.9914 0.9883 1.0008
dispcorr: -0.019178864 hartree
energy: -1906.388156479258
dipole: -6.71248 6.80392 0.09144 -7.06049 6.69298 -0.36751 6.72920 -5.15469 1.57451
magnitude: 1.61941 au
magnitude: 4.11623 debye
