program: Orca
programVersion: 5.0.2
elementType: S S P O O O O C C C C C C C C C C C C H H H H H H H H H H H H H H H H H
charge: 0
multiplicity: 1
keywords: wb97x-d3
keywords: def2-TZVPP
keywords: def2/J RIJCOSX
keywords: DEFGRID2
keywords: scfconv7
keywords: smallprint printgap noloewdin
keywords: NOSOSCF
formula: C12H17O4PS2
InChI: InChI=1/C12H17O4PS2/c1-4-16-12(13)11(10-8-6-5-7-9-10)19-17(18,14-2)15-3/h5-9,11H,4H2,1-3H3
36 atoms
S  0.595028 -0.015959 1.024665
S  1.561823 0.939784 -2.111553
P  2.041497 0.827683 -0.255135
O  -0.234827 -2.661175 -0.418827
O  3.366511 0.015711 0.115236
O  2.43073 2.182246 0.493188
O  -2.109707 -2.253804 0.736939
C  -0.794804 -0.412614 -0.112451
C  -1.933853 0.544647 0.054205
C  -1.148895 -1.870577 0.134683
C  -2.283796 1.361967 -1.014198
C  -2.634151 0.659817 1.252429
C  -3.326125 2.27108 -0.897126
C  -3.672621 1.56709 1.369055
C  -4.02463 2.373318 0.294288
C  -0.366659 -4.073132 -0.228778
C  0.167831 -4.518483 1.11525
C  3.512637 -1.307885 -0.385655
C  1.522787 3.277694 0.443949
H  -0.383993 -0.329103 -1.123417
H  -1.732396 1.292217 -1.943952
H  -2.370632 0.040976 2.099275
H  -3.588814 2.898523 -1.738552
H  -4.213138 1.644091 2.303167
H  -4.839071 3.079454 0.389245
H  -1.407645 -4.375041 -0.354683
H  0.212652 -4.513288 -1.039634
H  1.2041 -4.209574 1.253281
H  -0.425417 -4.121788 1.937319
H  0.133711 -5.606642 1.176518
H  2.669696 -1.939283 -0.093086
H  4.425468 -1.705773 0.049741
H  3.595977 -1.308924 -1.473285
H  0.554148 3.009814 0.872159
H  1.37775 3.620977 -0.58099
H  1.966667 4.074385 1.034647
totalener: -1906.34989352 hartree
nucrepener: 2010.10150777 hartree
electener: -3916.45140129 hartree
oneelecener: -6620.04963638 hartree
twoeener: 2703.59823509 hartree
kineticenergy: 1901.00687105 hartree
xcener: -128.472759912793 hartree
chargesum: -0.0000000
charge: -0.157917 -0.389973 0.648056 -0.262526 -0.304544 -0.300672 -0.342210 0.043477 0.088398 0.325542 -0.181322 -0.149105 -0.122059 -0.132524 -0.132935 0.009650 -0.249580 -0.110484 -0.127646 0.121557 0.113363 0.107584 0.125897 0.124097 0.125068 0.098430 0.101322 0.081961 0.101270 0.088628 0.079565 0.119319 0.118445 0.106544 0.115528 0.119797
qa: -0.1579 -0.3900 0.6481 -0.2625 -0.3045 -0.3007 -0.3422 0.0435 0.0884 0.3255 -0.1813 -0.1491 -0.1221 -0.1325 -0.1329 0.0096 -0.2496 -0.1105 -0.1276 0.1216 0.1134 0.1076 0.1259 0.1241 0.1251 0.0984 0.1013 0.0820 0.1013 0.0886 0.0796 0.1193 0.1184 0.1065 0.1155 0.1198
va: 2.2919 2.0700 5.3982 2.1354 2.1409 2.1387 2.1489 3.7353 3.5093 4.2768 3.9998 4.0371 3.9734 3.9765 3.9658 3.8676 3.9233 3.8904 3.8812 1.0944 1.0198 1.0268 1.0011 1.0010 0.9998 1.0109 0.9952 1.0021 1.0116 1.0104 0.9973 0.9931 0.9995 0.9910 0.9975 0.9941
dispcorr: -0.018347894 hartree
energy: -1906.368241415999
dipole: -4.70881 4.90937 0.20056 -8.81496 8.41667 -0.39828 2.90758 -2.73737 0.17022
magnitude: 0.47732 au
magnitude: 1.21324 debye
