program: Orca
programVersion: 5.0.2
elementType: S S P O O O O C C C C C C C C C C C C H H H H H H H H H H H H H H H H H
charge: 0
multiplicity: 1
keywords: wb97x-d3
keywords: def2-TZVPP
keywords: def2/J RIJCOSX
keywords: DEFGRID2
keywords: scfconv7
keywords: smallprint printgap noloewdin
keywords: NOSOSCF
formula: C12H17O4PS2
InChI: InChI=1/C12H17O4PS2/c1-4-16-12(13)11(10-8-6-5-7-9-10)19-17(18,14-2)15-3/h5-9,11H,4H2,1-3H3
36 atoms
S  1.395983 -0.601092 0.719836
S  1.646846 1.548953 -1.925557
P  1.810829 1.303095 -0.023369
O  -1.292582 -2.796616 -0.988638
O  3.271824 1.527493 0.602564
O  0.933992 2.260033 0.903223
O  -0.129596 -3.011492 0.919018
C  -0.086453 -0.932118 -0.295377
C  -1.238282 -0.013183 0.027077
C  -0.483356 -2.372371 -0.030948
C  -1.68505 0.133206 1.336664
C  -1.866364 0.691972 -0.990878
C  -2.749895 0.971311 1.620102
C  -2.932483 1.53384 -0.705632
C  -3.377174 1.674187 0.599315
C  -1.872811 -4.099308 -0.855252
C  -3.068875 -4.091307 0.071312
C  4.411312 0.968076 -0.04004
C  0.307736 3.443436 0.421902
H  0.188917 -0.817028 -1.346809
H  -1.183956 -0.395255 2.138209
H  -1.510774 0.593894 -2.008263
H  -3.088752 1.080923 2.641797
H  -3.411255 2.082835 -1.505799
H  -4.206693 2.331967 0.823412
H  -2.16958 -4.369071 -1.867886
H  -1.119449 -4.814278 -0.520364
H  -3.812143 -3.362609 -0.250815
H  -3.538459 -5.075349 0.065117
H  -2.782494 -3.86705 1.097403
H  4.364539 -0.122685 -0.056085
H  5.278755 1.277377 0.537534
H  4.505373 1.333145 -1.063385
H  -0.495992 3.671047 1.117418
H  -0.11007 3.297616 -0.573863
H  1.015566 4.272767 0.396341
totalener: -1906.34996023 hartree
nucrepener: 2033.08786601 hartree
electener: -3939.43782624 hartree
oneelecener: -6666.41058367 hartree
twoeener: 2726.97275743 hartree
kineticenergy: 1901.02627588 hartree
xcener: -128.479656687253 hartree
chargesum: 0.0000000
charge: -0.114633 -0.415075 0.637418 -0.260746 -0.328002 -0.301198 -0.345228 0.064733 0.032452 0.317357 -0.126855 -0.187802 -0.131795 -0.114318 -0.137329 0.017437 -0.248253 -0.122458 -0.123149 0.119951 0.126283 0.109784 0.128098 0.127599 0.127793 0.099233 0.091392 0.088711 0.084932 0.099003 0.103550 0.117358 0.112424 0.115688 0.105379 0.130267
qa: -0.1146 -0.4151 0.6374 -0.2607 -0.3280 -0.3012 -0.3452 0.0647 0.0325 0.3174 -0.1269 -0.1878 -0.1318 -0.1143 -0.1373 0.0174 -0.2483 -0.1225 -0.1231 0.1200 0.1263 0.1098 0.1281 0.1276 0.1278 0.0992 0.0914 0.0887 0.0849 0.0990 0.1035 0.1174 0.1124 0.1157 0.1054 0.1303
va: 2.3561 2.0314 5.4165 2.1600 2.1197 2.1094 2.1445 3.8753 3.4241 4.2764 3.9665 4.0093 3.9601 3.9334 3.9474 3.8850 3.9141 3.8761 3.8529 1.0613 1.0234 1.0232 1.0005 1.0002 0.9992 0.9948 1.0087 1.0045 1.0104 1.0115 0.9945 0.9915 1.0031 0.9882 1.0051 0.9939
dispcorr: -0.019551649 hartree
energy: -1906.369511877335
dipole: -13.47144 12.68454 -0.78690 -4.41347 4.48314 0.06966 -0.14091 -0.03099 -0.17190
magnitude: 0.80846 au
magnitude: 2.05494 debye
