program: Orca
programVersion: 5.0.2
elementType: S S P O O O O C C C C C C C C C C C C H H H H H H H H H H H H H H H H H
charge: 0
multiplicity: 1
keywords: wb97x-d3
keywords: def2-TZVPP
keywords: def2/J RIJCOSX
keywords: DEFGRID2
keywords: scfconv7
keywords: smallprint printgap noloewdin
keywords: NOSOSCF
formula: C12H17O4PS2
InChI: InChI=1/C12H17O4PS2/c1-4-16-12(13)11(10-8-6-5-7-9-10)19-17(18,14-2)15-3/h5-9,11H,4H2,1-3H3
36 atoms
S  0.882417 -0.383611 0.852851
S  1.572399 1.310585 -2.021588
P  1.913128 1.164309 -0.137851
O  -0.476481 -2.852898 -0.834706
O  3.407417 0.854161 0.337244
O  1.713131 2.478141 0.741265
O  -1.833642 -2.353837 0.874642
C  -0.597195 -0.595142 -0.220676
C  -1.652106 0.431344 0.063036
C  -1.05939 -2.025801 0.022121
C  -2.082495 1.257526 -0.967827
C  -2.185512 0.603772 1.338714
C  -3.031738 2.243472 -0.733608
C  -3.133675 1.584924 1.570484
C  -3.558542 2.40992 0.536294
C  -0.735579 -4.254353 -0.690211
C  0.10983 -4.87942 0.398742
C  4.143053 -0.18346 -0.299449
C  0.512904 3.238529 0.644307
H  -0.243775 -0.504449 -1.250438
H  -1.659762 1.142488 -1.957919
H  -1.849757 -0.019668 2.155499
H  -3.353641 2.882156 -1.545469
H  -3.541867 1.709222 2.564831
H  -4.296476 3.178879 0.723421
H  -1.797776 -4.423598 -0.506887
H  -0.487406 -4.678611 -1.662088
H  1.171239 -4.704228 0.225954
H  -0.151953 -4.496757 1.383648
H  -0.05324 -5.957528 0.408534
H  5.131214 -0.185333 0.152841
H  4.233664 -0.002598 -1.371181
H  3.673831 -1.156518 -0.140509
H  -0.322643 2.718208 1.114769
H  0.260573 3.451808 -0.395146
H  0.696052 4.172029 1.170041
totalener: -1906.35053361 hartree
nucrepener: 2018.64292241 hartree
electener: -3924.99345602 hartree
oneelecener: -6637.18839079 hartree
twoeener: 2712.19493477 hartree
kineticenergy: 1901.00837425 hartree
xcener: -128.475529183591 hartree
chargesum: -0.0000000
charge: -0.153862 -0.393591 0.641088 -0.256175 -0.312834 -0.295486 -0.347614 0.066570 0.025713 0.319646 -0.181720 -0.128669 -0.120917 -0.140141 -0.124635 0.029265 -0.253671 -0.124077 -0.117752 0.123315 0.114917 0.110103 0.128322 0.126717 0.127417 0.089386 0.100240 0.085570 0.100949 0.085005 0.118489 0.114710 0.101862 0.109419 0.112131 0.120310
qa: -0.1539 -0.3936 0.6411 -0.2562 -0.3128 -0.2955 -0.3476 0.0666 0.0257 0.3196 -0.1817 -0.1287 -0.1209 -0.1401 -0.1246 0.0293 -0.2537 -0.1241 -0.1178 0.1233 0.1149 0.1101 0.1283 0.1267 0.1274 0.0894 0.1002 0.0856 0.1009 0.0850 0.1185 0.1147 0.1019 0.1094 0.1121 0.1203
va: 2.2974 2.0660 5.4182 2.1605 2.1368 2.1471 2.1450 3.7716 3.5024 4.2936 3.9742 3.9773 3.9607 3.9703 3.9454 3.8742 3.9165 3.8743 3.8862 1.0778 1.0204 1.0344 1.0006 1.0017 0.9995 1.0102 0.9949 1.0054 1.0118 1.0100 0.9924 1.0008 0.9961 0.9830 1.0033 0.9940
dispcorr: -0.019117570 hartree
energy: -1906.369651178370
dipole: -5.15354 5.18496 0.03141 -8.80570 8.35300 -0.45270 1.30916 -1.35102 -0.04186
magnitude: 0.45572 au
magnitude: 1.15834 debye
