program: Orca
programVersion: 5.0.2
elementType: S S P O O O O C C C C C C C C C C C C H H H H H H H H H H H H H H H H H
charge: 0
multiplicity: 1
keywords: wb97x-d3
keywords: def2-TZVPP
keywords: def2/J RIJCOSX
keywords: DEFGRID2
keywords: scfconv7
keywords: smallprint printgap noloewdin
keywords: NOSOSCF
formula: C12H17O4PS2
InChI: InChI=1/C12H17O4PS2/c1-4-16-12(13)11(10-8-6-5-7-9-10)19-17(18,14-2)15-3/h5-9,11H,4H2,1-3H3
36 atoms
S  1.285418 -0.360816 0.812377
S  1.675797 1.175212 -2.20955
P  1.821671 1.332718 -0.306887
O  -1.27675 -2.814428 -0.679244
O  3.286368 1.569519 0.312713
O  1.018388 2.580587 0.268817
O  -0.239633 -2.761886 1.309606
C  -0.230651 -0.815127 -0.105163
C  -1.381344 0.102741 0.216086
C  -0.56013 -2.245058 0.275844
C  -1.924067 0.906725 -0.77699
C  -1.896305 0.170231 1.50854
C  -2.972639 1.767672 -0.484303
C  -2.944844 1.026551 1.797571
C  -3.486385 1.8281 0.800635
C  -1.7388 -4.154579 -0.469881
C  -0.67201 -5.180948 -0.785736
C  4.389113 0.792517 -0.138757
C  0.90243 2.865206 1.658299
H  -0.00186 -0.764898 -1.172565
H  -1.512838 0.873888 -1.777696
H  -1.46937 -0.443694 2.29251
H  -3.383591 2.395118 -1.263948
H  -3.340938 1.069896 2.803673
H  -4.304001 2.499328 1.028263
H  -2.103337 -4.270112 0.552115
H  -2.586322 -4.25747 -1.14605
H  -1.100989 -6.181011 -0.715704
H  -0.288423 -5.054246 -1.797811
H  0.160022 -5.126176 -0.086185
H  5.272378 1.17904 0.36356
H  4.514745 0.882403 -1.218219
H  4.264068 -0.261055 0.118605
H  0.167932 3.661114 1.749881
H  1.8535 3.201273 2.072182
H  0.550817 1.995135 2.214586
totalener: -1906.35078076 hartree
nucrepener: 2016.90978648 hartree
electener: -3923.26056725 hartree
oneelecener: -6633.95425960 hartree
twoeener: 2710.69369235 hartree
kineticenergy: 1901.01644586 hartree
xcener: -128.476744803880 hartree
chargesum: 0.0000000
charge: -0.150019 -0.383503 0.646521 -0.262752 -0.337593 -0.295381 -0.356110 0.092535 0.017041 0.332918 -0.147456 -0.210830 -0.118344 -0.112128 -0.135965 0.021284 -0.250819 -0.122350 -0.134704 0.125958 0.117318 0.134973 0.127522 0.128498 0.126900 0.089040 0.100833 0.083257 0.086968 0.100887 0.115748 0.113616 0.105348 0.120758 0.129893 0.100140
qa: -0.1500 -0.3835 0.6465 -0.2628 -0.3376 -0.2954 -0.3561 0.0925 0.0170 0.3329 -0.1475 -0.2108 -0.1183 -0.1121 -0.1360 0.0213 -0.2508 -0.1224 -0.1347 0.1260 0.1173 0.1350 0.1275 0.1285 0.1269 0.0890 0.1008 0.0833 0.0870 0.1009 0.1157 0.1136 0.1053 0.1208 0.1299 0.1001
va: 2.3180 2.0851 5.4138 2.1616 2.0936 2.1304 2.1335 3.8490 3.4708 4.2489 4.0169 3.9680 3.9780 3.9490 3.9655 3.8858 3.9127 3.8812 3.8651 1.0668 1.0216 1.0227 1.0006 0.9996 0.9992 1.0094 0.9946 1.0097 1.0050 1.0112 0.9915 1.0025 0.9933 0.9893 0.9927 0.9999
dispcorr: -0.018687315 hartree
energy: -1906.369468077668
dipole: -6.76449 6.36399 -0.40050 -9.33508 9.03450 -0.30058 3.57823 -2.99933 0.57890
magnitude: 0.76542 au
magnitude: 1.94554 debye
