program: Orca
programVersion: 5.0.2
elementType: S P O O O O O N C C C C C C C C C C H H H H H H H H H H H H H H
charge: 0
multiplicity: 1
keywords: wb97x-d3
keywords: def2-TZVPP
keywords: def2/J RIJCOSX
keywords: DEFGRID2
keywords: scfconv7
keywords: smallprint printgap noloewdin
keywords: NOSOSCF
formula: C10H14NO5PS
InChI: InChI=1/C10H14NO5PS/c1-3-14-17(18,15-4-2)16-10-7-5-9(6-8-10)11(12)13/h5-8H,3-4H2,1-2H3
32 atoms
S  -1.808823 0.870732 -1.588307
P  -1.815708 0.305771 0.246044
O  -0.505761 0.717176 1.119809
O  -2.948754 0.883924 1.192822
O  -1.863462 -1.25454 0.53876
O  5.244788 0.192036 -1.199621
O  5.170326 -1.571972 -0.004445
N  4.672455 -0.561949 -0.446346
C  0.760687 0.385678 0.705462
C  -3.642067 2.12826 0.94096
C  -2.559346 -2.188854 -0.320384
C  1.446973 1.245783 -0.139542
C  1.341393 -0.78358 1.174784
C  3.316487 -0.234516 -0.047768
C  2.738096 0.934611 -0.520944
C  2.634617 -1.095678 0.800088
C  -4.959138 1.87312 0.256044
C  -1.585792 -2.89952 -1.223593
H  -3.786318 2.58039 1.920714
H  -3.014313 2.798804 0.352541
H  -3.057898 -2.884805 0.352217
H  -3.329558 -1.674712 -0.897557
H  0.982344 2.157259 -0.488091
H  0.796172 -1.43898 1.839876
H  3.27394 1.604299 -1.1773
H  3.088819 -2.004432 1.166481
H  -5.590904 1.205789 0.842176
H  -5.489272 2.818426 0.138178
H  -4.81795 1.441497 -0.734587
H  -2.121785 -3.647442 -1.808471
H  -1.107402 -2.208999 -1.917771
H  -0.813132 -3.413213 -0.651449
elementType: S P O N C H
totalener: -1560.03730257 hartree
nucrepener: 1673.85101468 hartree
electener: -3233.88831725 hartree
oneelecener: -5470.09873528 hartree
twoeener: 2236.21041803 hartree
cpcmener: -0.02553411 hartree
kineticenergy: 1555.24761329 hartree
xcener: -112.196459718928 hartree
chargesum: -0.0000000
charge: -0.445657 0.770566 -0.353931 -0.351217 -0.348729 -0.396048 -0.396156 0.545879 0.260689 0.051805 0.053119 -0.151983 -0.159484 0.044716 -0.112340 -0.106895 -0.235899 -0.243464 0.109055 0.088303 0.108858 0.089676 0.155862 0.159016 0.165421 0.165976 0.090483 0.097157 0.075602 0.102266 0.077313 0.090044
qa: -0.4457 0.7706 -0.3539 -0.3512 -0.3487 -0.3960 -0.3962 0.5459 0.2607 0.0518 0.0531 -0.1520 -0.1595 0.0447 -0.1123 -0.1069 -0.2359 -0.2435 0.1091 0.0883 0.1089 0.0897 0.1559 0.1590 0.1654 0.1660 0.0905 0.0972 0.0756 0.1023 0.0773 0.0900
va: 1.9712 5.4905 2.1138 2.1058 2.1063 1.8594 1.8591 4.1358 3.7797 3.8395 3.8438 4.0152 4.0191 3.7646 4.0400 4.0287 3.9204 3.9179 0.9957 1.0115 0.9967 1.0075 1.0056 1.0039 1.0117 1.0103 1.0040 1.0083 1.0176 1.0093 1.0178 1.0035
dispcorr: -0.014645990 hartree
energy: -1560.051948558738
dipole: -21.72893 18.80428 -2.92466 -2.93083 2.98191 0.05108 -0.94887 1.85216 0.90330
magnitude: 3.06140 au
magnitude: 7.78146 debye
