program: Orca
programVersion: 5.0.2
elementType: S P O O O O O N C C C C C C C C C C H H H H H H H H H H H H H H
charge: 0
multiplicity: 1
keywords: wb97x-d3
keywords: def2-TZVPP
keywords: def2/J RIJCOSX
keywords: DEFGRID2
keywords: scfconv7
keywords: smallprint printgap noloewdin
keywords: NOSOSCF
formula: C10H14NO5PS
InChI: InChI=1/C10H14NO5PS/c1-3-14-17(18,15-4-2)16-10-7-5-9(6-8-10)11(12)13/h5-8H,3-4H2,1-2H3
32 atoms
S  -3.471415 0.498158 -1.409916
P  -1.973073 -0.217418 -0.459741
O  -0.58066 0.14158 -1.216139
O  -1.771097 0.257244 1.046939
O  -1.843466 -1.796218 -0.349377
O  5.436729 1.053272 -0.002275
O  5.023128 -0.436715 1.466109
N  4.684038 0.288909 0.558589
C  0.688852 0.136844 -0.715186
C  -2.133252 1.581726 1.499485
C  -2.982748 -2.659204 -0.130831
C  1.57369 1.022764 -1.320819
C  1.112665 -0.699551 0.311534
C  3.305048 0.241554 0.121534
C  2.888018 1.076248 -0.906515
C  2.428112 -0.642088 0.73221
C  -1.22322 2.654515 0.95528
C  -3.569743 -2.522293 1.25165
H  -3.174357 1.773642 1.234902
H  -2.065268 1.526658 2.583881
H  -3.730399 -2.458643 -0.900191
H  -2.595187 -3.663158 -0.290856
H  1.230397 1.667168 -2.118668
H  0.451436 -1.409889 0.785429
H  3.567459 1.764422 -1.387359
H  2.750524 -1.296383 1.528816
H  -0.178216 2.454592 1.191353
H  -1.324892 2.775879 -0.123729
H  -1.493344 3.605088 1.416002
H  -2.8163 -2.666392 2.025494
H  -4.052009 -1.556721 1.404568
H  -4.332101 -3.290973 1.380603
elementType: S P O N C H
totalener: -1560.03794927 hartree
nucrepener: 1684.56003937 hartree
electener: -3244.59798864 hartree
oneelecener: -5490.94763092 hartree
twoeener: 2246.34964228 hartree
cpcmener: -0.02702827 hartree
kineticenergy: 1555.23678167 hartree
xcener: -112.197809856069 hartree
chargesum: 0.0000000
charge: -0.421269 0.697402 -0.313150 -0.330629 -0.331567 -0.399792 -0.399128 0.544113 0.209095 0.034758 0.024025 -0.145415 -0.101486 0.042693 -0.106444 -0.140100 -0.239839 -0.237324 0.099414 0.113973 0.097327 0.110968 0.153350 0.149133 0.165537 0.165430 0.088037 0.084506 0.110877 0.093255 0.080649 0.101602
qa: -0.4213 0.6974 -0.3132 -0.3306 -0.3316 -0.3998 -0.3991 0.5441 0.2091 0.0348 0.0240 -0.1454 -0.1015 0.0427 -0.1064 -0.1401 -0.2398 -0.2373 0.0994 0.1140 0.0973 0.1110 0.1534 0.1491 0.1655 0.1654 0.0880 0.0845 0.1109 0.0933 0.0806 0.1016
va: 2.0382 5.5080 2.1447 2.0492 2.1018 1.8540 1.8564 4.1360 3.8479 3.8287 3.8546 3.9710 3.8951 3.7590 4.0434 4.1010 3.8984 3.8950 1.0114 0.9915 1.0099 0.9913 1.0056 1.0225 1.0097 1.0133 1.0056 1.0160 1.0099 1.0046 1.0151 1.0087
dispcorr: -0.015701513 hartree
energy: -1560.053650780622
dipole: -14.70747 12.73173 -1.97574 -0.65392 0.28025 -0.37367 8.91636 -7.97239 0.94397
magnitude: 2.22132 au
magnitude: 5.64615 debye
