program: Orca
programVersion: 5.0.2
elementType: S P O O O O O N C C C C C C C C C C H H H H H H H H H H H H H H
charge: 0
multiplicity: 1
keywords: wb97x-d3
keywords: def2-TZVPP
keywords: def2/J RIJCOSX
keywords: DEFGRID2
keywords: scfconv7
keywords: smallprint printgap noloewdin
keywords: NOSOSCF
formula: C10H14NO5PS
InChI: InChI=1/C10H14NO5PS/c1-3-14-17(18,15-4-2)16-10-7-5-9(6-8-10)11(12)13/h5-8H,3-4H2,1-2H3
32 atoms
S  -1.892623 0.767914 -1.876791
P  -1.792976 0.760655 0.038301
O  -0.42072 1.323639 0.703265
O  -2.750194 1.747528 0.832042
O  -1.971114 -0.651215 0.752532
O  4.900007 -1.906096 0.697782
O  5.112444 -0.847581 -1.140451
N  4.496174 -1.131381 -0.138878
C  0.779839 0.696401 0.477067
C  -4.085586 2.042168 0.368226
C  -2.150856 -1.904738 0.056856
C  1.259935 -0.199032 1.421408
C  1.503812 0.997531 -0.667556
C  3.205222 -0.503401 0.072942
C  2.485653 -0.805036 1.220372
C  2.730235 0.394772 -0.871811
C  -5.006463 0.849525 0.444021
C  -0.83193 -2.564595 -0.253163
H  -4.429489 2.842418 1.020267
H  -4.030565 2.434763 -0.648645
H  -2.747778 -2.517073 0.730248
H  -2.731905 -1.739916 -0.851478
H  0.685677 -0.41718 2.311251
H  1.122976 1.70862 -1.386926
H  2.860233 -1.501267 1.956348
H  3.296554 0.632279 -1.760194
H  -5.031525 0.422516 1.446111
H  -6.016747 1.173634 0.19343
H  -4.731646 0.067361 -0.265031
H  -1.022944 -3.526104 -0.73107
H  -0.231399 -1.965119 -0.938376
H  -0.252332 -2.750621 0.650521
elementType: S P O N C H
totalener: -1560.03776636 hartree
nucrepener: 1695.22484755 hartree
electener: -3255.26261391 hartree
oneelecener: -5512.58231241 hartree
twoeener: 2257.31969850 hartree
cpcmener: -0.02636757 hartree
kineticenergy: 1555.25521539 hartree
xcener: -112.200465547483 hartree
chargesum: -0.0000000
charge: -0.440718 0.739020 -0.350430 -0.347098 -0.348202 -0.395835 -0.395816 0.546413 0.260204 0.035854 0.060768 -0.171618 -0.145679 0.050558 -0.104374 -0.114834 -0.241008 -0.249135 0.112201 0.096622 0.113237 0.093595 0.160056 0.153032 0.165815 0.165120 0.093427 0.101844 0.078059 0.110659 0.076025 0.092235
qa: -0.4407 0.7390 -0.3504 -0.3471 -0.3482 -0.3958 -0.3958 0.5464 0.2602 0.0359 0.0608 -0.1716 -0.1457 0.0506 -0.1044 -0.1148 -0.2410 -0.2491 0.1122 0.0966 0.1132 0.0936 0.1601 0.1530 0.1658 0.1651 0.0934 0.1018 0.0781 0.1107 0.0760 0.0922
va: 1.9842 5.5166 2.1187 2.1147 2.0730 1.8597 1.8592 4.1359 3.7446 3.8451 3.8031 3.9903 4.0166 3.7522 4.0077 4.0521 3.8948 3.9336 0.9923 1.0108 0.9921 1.0115 1.0032 1.0073 1.0097 1.0117 1.0066 1.0084 1.0114 1.0105 1.0100 1.0023
dispcorr: -0.016202962 hartree
energy: -1560.053969317756
dipole: -20.06572 17.24624 -2.81948 -5.94685 5.80339 -0.14346 1.76859 -0.94783 0.82075
magnitude: 2.94001 au
magnitude: 7.47292 debye
