program: Orca
programVersion: 5.0.2
elementType: S P O O O O O N C C C C C C C C C C H H H H H H H H H H H H H H
charge: 0
multiplicity: 1
keywords: wb97x-d3
keywords: def2-TZVPP
keywords: def2/J RIJCOSX
keywords: DEFGRID2
keywords: scfconv7
keywords: smallprint printgap noloewdin
keywords: NOSOSCF
formula: C10H14NO5PS
InChI: InChI=1/C10H14NO5PS/c1-3-14-17(18,15-4-2)16-10-7-5-9(6-8-10)11(12)13/h5-8H,3-4H2,1-2H3
32 atoms
S  -2.275741 0.604673 -1.660505
P  -2.032355 -0.254165 0.038144
O  -0.720566 -1.217324 0.158853
O  -1.870378 0.667768 1.320047
O  -3.144638 -1.278957 0.512698
O  4.917015 1.134767 -1.024975
O  5.044949 0.91561 1.092356
N  4.447805 0.820114 0.044907
C  0.544614 -0.689375 0.120159
C  -1.979335 2.110047 1.293644
C  -3.939599 -2.052804 -0.411713
C  1.141917 -0.411703 -1.100892
C  1.212804 -0.474488 1.316921
C  3.094695 0.300249 0.072445
C  2.429002 0.090437 -1.126146
C  2.502745 0.018448 1.295667
C  -0.653615 2.757812 0.984417
C  -3.157562 -3.175966 -1.045376
H  -2.74201 2.40907 0.573625
H  -2.329982 2.382228 2.287304
H  -4.760635 -2.437805 0.18944
H  -4.358916 -1.387837 -1.168757
H  0.613116 -0.597767 -2.02479
H  0.732422 -0.701717 2.258654
H  2.898445 0.304346 -2.07491
H  3.025546 0.182272 2.226174
H  -0.301823 2.500193 -0.015071
H  -0.773145 3.840966 1.026515
H  0.111036 2.477205 1.708536
H  -2.372846 -2.808045 -1.707066
H  -2.708764 -3.826023 -0.294889
H  -3.837189 -3.778935 -1.647701
elementType: S P O N C H
totalener: -1560.03740631 hartree
nucrepener: 1697.28131994 hartree
electener: -3257.31872625 hartree
oneelecener: -5516.76325694 hartree
twoeener: 2259.44453069 hartree
cpcmener: -0.02511915 hartree
kineticenergy: 1555.26406190 hartree
xcener: -112.201354605037 hartree
chargesum: 0.0000000
charge: -0.443038 0.758820 -0.348848 -0.355885 -0.351649 -0.396670 -0.396095 0.546015 0.287610 0.052808 0.032646 -0.155247 -0.179956 0.052982 -0.115493 -0.105871 -0.250075 -0.236541 0.093951 0.111457 0.112516 0.094356 0.153727 0.157731 0.165995 0.165529 0.078705 0.109648 0.090741 0.078285 0.091590 0.100256
qa: -0.4430 0.7588 -0.3488 -0.3559 -0.3516 -0.3967 -0.3961 0.5460 0.2876 0.0528 0.0326 -0.1552 -0.1800 0.0530 -0.1155 -0.1059 -0.2501 -0.2365 0.0940 0.1115 0.1125 0.0944 0.1537 0.1577 0.1660 0.1655 0.0787 0.1096 0.0907 0.0783 0.0916 0.1003
va: 1.9814 5.4899 2.0827 2.1081 2.1220 1.8584 1.8591 4.1335 3.7122 3.8251 3.8557 4.0174 4.0158 3.7489 4.0489 4.0130 3.9064 3.8911 1.0132 0.9945 0.9917 1.0112 1.0057 1.0043 1.0118 1.0096 1.0126 1.0110 1.0036 1.0166 1.0066 1.0082
dispcorr: -0.015879088 hartree
energy: -1560.053285399972
dipole: -13.43537 11.15290 -2.28246 -1.42026 0.76353 -0.65673 1.31306 -0.66883 0.64423
magnitude: 2.46088 au
magnitude: 6.25507 debye
