program: Orca
programVersion: 5.0.2
elementType: S P O O O O O N C C C C C C C C C C H H H H H H H H H H H H H H
charge: 0
multiplicity: 1
keywords: wb97x-d3
keywords: def2-TZVPP
keywords: def2/J RIJCOSX
keywords: DEFGRID2
keywords: scfconv7
keywords: smallprint printgap noloewdin
keywords: NOSOSCF
formula: C10H14NO5PS
InChI: InChI=1/C10H14NO5PS/c1-3-14-17(18,15-4-2)16-10-7-5-9(6-8-10)11(12)13/h5-8H,3-4H2,1-2H3
32 atoms
S  -1.642564 0.671136 -1.651859
P  -1.724342 0.05636 0.162768
O  -0.461844 0.462312 1.101806
O  -2.905708 0.58405 1.081125
O  -1.778979 -1.514092 0.399275
O  5.40747 0.665537 -0.952197
O  5.391687 -1.281764 -0.083301
N  4.850393 -0.23963 -0.374208
C  0.836342 0.271452 0.697931
C  -3.379492 1.951235 1.008012
C  -2.436864 -2.40751 -0.528589
C  1.481245 1.273733 -0.012274
C  1.48768 -0.901586 1.049318
C  3.456998 -0.064926 -0.008493
C  2.806493 1.107408 -0.367165
C  2.81355 -1.071524 0.697321
C  -4.63398 2.033155 0.177197
C  -3.936896 -2.251936 -0.515253
H  -3.565883 2.247278 2.039335
H  -2.599957 2.605238 0.611606
H  -2.030429 -2.244666 -1.528208
H  -2.143253 -3.403167 -0.203386
H  0.957904 2.182512 -0.27497
H  0.972121 -1.669901 1.609159
H  3.310897 1.888844 -0.916483
H  3.324264 -1.980693 0.978681
H  -5.012747 3.055254 0.204485
H  -4.442558 1.773502 -0.863837
H  -5.413252 1.37696 0.565965
H  -4.372826 -3.018904 -1.155709
H  -4.345991 -2.380215 0.486548
H  -4.254706 -1.283386 -0.903402
elementType: S P O N C H
totalener: -1560.03836516 hartree
nucrepener: 1669.79134454 hartree
electener: -3229.82970970 hartree
oneelecener: -5461.98855787 hartree
twoeener: 2232.15884817 hartree
cpcmener: -0.02589360 hartree
kineticenergy: 1555.24710343 hartree
xcener: -112.196050432324 hartree
chargesum: 0.0000000
charge: -0.442467 0.761427 -0.355753 -0.346289 -0.351369 -0.396014 -0.395880 0.545275 0.247080 0.053748 0.033369 -0.151040 -0.140620 0.048442 -0.112444 -0.118160 -0.247457 -0.234381 0.109005 0.093908 0.096604 0.111182 0.158287 0.159690 0.166020 0.166129 0.101246 0.078128 0.091967 0.101113 0.093891 0.075364
qa: -0.4425 0.7614 -0.3558 -0.3463 -0.3514 -0.3960 -0.3959 0.5453 0.2471 0.0537 0.0334 -0.1510 -0.1406 0.0484 -0.1124 -0.1182 -0.2475 -0.2344 0.1090 0.0939 0.0966 0.1112 0.1583 0.1597 0.1660 0.1661 0.1012 0.0781 0.0920 0.1011 0.0939 0.0754
va: 1.9798 5.5023 2.1157 2.0914 2.1183 1.8593 1.8595 4.1360 3.7854 3.8425 3.8539 4.0125 4.0365 3.7586 4.0388 4.0415 3.9205 3.9013 0.9960 1.0048 1.0099 0.9922 1.0028 1.0028 1.0111 1.0108 1.0100 1.0157 1.0022 1.0093 1.0060 1.0124
dispcorr: -0.014739795 hartree
energy: -1560.053104958263
dipole: -26.27157 23.33537 -2.93620 -0.92715 0.91124 -0.01591 0.59011 0.35812 0.94823
magnitude: 3.08556 au
magnitude: 7.84286 debye
