program: Orca
programVersion: 5.0.2
elementType: S P O O O O O N C C C C C C C C C C H H H H H H H H H H H H H H
charge: 0
multiplicity: 1
keywords: wb97x-d3
keywords: def2-TZVPP
keywords: def2/J RIJCOSX
keywords: DEFGRID2
keywords: scfconv7
keywords: smallprint printgap noloewdin
keywords: NOSOSCF
formula: C10H14NO5PS
InChI: InChI=1/C10H14NO5PS/c1-3-14-17(18,15-4-2)16-10-7-5-9(6-8-10)11(12)13/h5-8H,3-4H2,1-2H3
32 atoms
S  -1.709478 -0.135174 -2.275692
P  -2.070162 0.031632 -0.40558
O  -0.872412 -0.485546 0.583817
O  -2.376004 1.516048 0.049918
O  -3.276531 -0.800239 0.203227
O  5.024229 1.267874 -0.419361
O  5.333884 -0.595854 0.569276
N  4.611815 0.264587 0.118092
C  0.458981 -0.258897 0.417877
C  -2.636444 1.912995 1.423265
C  -3.649155 -2.109384 -0.285627
C  0.965542 0.896684 -0.168109
C  1.314741 -1.241767 0.902815
C  3.179836 0.081937 0.22259
C  2.333219 1.065691 -0.266275
C  2.681168 -1.072342 0.811077
C  -1.437754 2.599513 2.024591
C  -2.628795 -3.174454 0.031185
H  -3.486302 2.590719 1.365422
H  -2.93984 1.054986 2.024141
H  -4.596551 -2.321056 0.205371
H  -3.831423 -2.046274 -1.359646
H  0.318363 1.680798 -0.534535
H  0.908372 -2.136348 1.354895
H  2.718688 1.967411 -0.71879
H  3.337242 -1.841161 1.192184
H  -1.110827 3.444146 1.418426
H  -1.715587 2.983631 3.00664
H  -0.598142 1.919168 2.162054
H  -1.699553 -3.036142 -0.521914
H  -2.402835 -3.214549 1.096379
H  -3.039688 -4.141699 -0.259268
elementType: S P O N C H
totalener: -1560.03861774 hartree
nucrepener: 1685.80050637 hartree
electener: -3245.83912411 hartree
oneelecener: -5493.48086395 hartree
twoeener: 2247.64173984 hartree
cpcmener: -0.02935856 hartree
kineticenergy: 1555.23346205 hartree
xcener: -112.196525366132 hartree
chargesum: -0.0000000
charge: -0.423835 0.724617 -0.318231 -0.348585 -0.340081 -0.400260 -0.400140 0.544933 0.286228 0.035255 0.026463 -0.139793 -0.165189 0.034973 -0.125455 -0.107077 -0.253783 -0.236123 0.107353 0.103062 0.112200 0.097646 0.139982 0.157125 0.164412 0.165772 0.093146 0.106416 0.087668 0.077059 0.091719 0.102524
qa: -0.4238 0.7246 -0.3182 -0.3486 -0.3401 -0.4003 -0.4001 0.5449 0.2862 0.0353 0.0265 -0.1398 -0.1652 0.0350 -0.1255 -0.1071 -0.2538 -0.2361 0.1074 0.1031 0.1122 0.0976 0.1400 0.1571 0.1644 0.1658 0.0931 0.1064 0.0877 0.0771 0.0917 0.1025
va: 2.0145 5.4941 2.0786 2.1050 2.1061 1.8548 1.8540 4.1357 3.7456 3.8597 3.8593 3.9334 4.0099 3.7723 4.0840 4.0464 3.9209 3.8813 0.9947 1.0006 0.9913 1.0078 1.0225 0.9989 1.0127 1.0104 1.0030 1.0092 1.0016 1.0179 1.0063 1.0092
dispcorr: -0.015768172 hartree
energy: -1560.054385910530
dipole: -14.85387 12.00245 -2.85142 -2.74788 2.14211 -0.60577 10.06733 -7.95238 2.11494
magnitude: 3.60146 au
magnitude: 9.15419 debye
