program: Orca
programVersion: 5.0.2
elementType: S P O O O O O N C C C C C C C C C C H H H H H H H H H H H H H H
charge: 0
multiplicity: 1
keywords: wb97x-d3
keywords: def2-TZVPP
keywords: def2/J RIJCOSX
keywords: DEFGRID2
keywords: scfconv7
keywords: smallprint printgap noloewdin
keywords: NOSOSCF
formula: C10H14NO5PS
InChI: InChI=1/C10H14NO5PS/c1-3-14-17(18,15-4-2)16-10-7-5-9(6-8-10)11(12)13/h5-8H,3-4H2,1-2H3
32 atoms
S  -3.734608 0.142637 -1.107626
P  -2.213441 -0.003803 0.04185
O  -0.864787 0.26942 -0.836772
O  -2.117219 0.967567 1.293922
O  -1.953926 -1.370461 0.805002
O  4.926645 -0.368081 1.400453
O  5.327107 -0.003243 -0.662476
N  4.564359 -0.142833 0.267352
C  0.443293 0.156309 -0.478351
C  -2.56431 2.34077 1.243797
C  -2.260905 -2.65935 0.224988
C  1.349972 0.276694 -1.528244
C  0.892579 -0.05756 0.821414
C  3.145354 -0.038527 0.008333
C  2.70398 0.182144 -1.289741
C  2.250595 -0.158926 1.059927
C  -1.695814 3.208543 0.368062
C  -1.32506 -3.039387 -0.89505
H  -3.605175 2.363121 0.916606
H  -2.528902 2.673241 2.278985
H  -2.174265 -3.355889 1.056234
H  -3.299614 -2.659821 -0.109891
H  0.988256 0.443793 -2.533681
H  0.222179 -0.144892 1.662407
H  3.395015 0.281382 -2.113809
H  2.590049 -0.324698 2.071806
H  -2.013289 4.244961 0.483969
H  -0.646194 3.146359 0.655732
H  -1.788256 2.956519 -0.688441
H  -1.548836 -4.062462 -1.198741
H  -1.447866 -2.405878 -1.773745
H  -0.282812 -3.006538 -0.57832
elementType: S P O N C H
totalener: -1560.03800356 hartree
nucrepener: 1691.77201776 hartree
electener: -3251.81002133 hartree
oneelecener: -5505.23254601 hartree
twoeener: 2253.42252469 hartree
cpcmener: -0.02701573 hartree
kineticenergy: 1555.24240422 hartree
xcener: -112.198967645463 hartree
chargesum: -0.0000000
charge: -0.415136 0.673118 -0.298851 -0.332081 -0.334733 -0.401056 -0.401096 0.544614 0.228245 0.031176 0.029709 -0.145190 -0.089008 0.039025 -0.111256 -0.136595 -0.249048 -0.245831 0.098181 0.112566 0.113787 0.098336 0.152651 0.138316 0.165013 0.164808 0.107638 0.090692 0.085459 0.110005 0.086173 0.090367
qa: -0.4151 0.6731 -0.2989 -0.3321 -0.3347 -0.4011 -0.4011 0.5446 0.2282 0.0312 0.0297 -0.1452 -0.0890 0.0390 -0.1113 -0.1366 -0.2490 -0.2458 0.0982 0.1126 0.1138 0.0983 0.1527 0.1383 0.1650 0.1648 0.1076 0.0907 0.0855 0.1100 0.0862 0.0904
va: 2.0414 5.5198 2.0971 2.0969 2.0960 1.8543 1.8527 4.1355 3.7798 3.8461 3.8464 4.0048 3.8951 3.7612 4.0508 4.0960 3.8978 3.8946 1.0094 0.9918 0.9917 1.0095 1.0043 1.0294 1.0100 1.0130 1.0092 1.0045 1.0150 1.0090 1.0149 1.0046
dispcorr: -0.015972948 hartree
energy: -1560.053976509028
dipole: -8.51568 7.04925 -1.46643 0.25509 -0.22633 0.02875 0.31240 -0.00602 0.30638
magnitude: 1.49837 au
magnitude: 3.80855 debye
