program: Orca
programVersion: 5.0.2
elementType: S P O O O O O N C C C C C C C C C C H H H H H H H H H H H H H H
charge: 0
multiplicity: 1
keywords: wb97x-d3
keywords: def2-TZVPP
keywords: def2/J RIJCOSX
keywords: DEFGRID2
keywords: scfconv7
keywords: smallprint printgap noloewdin
keywords: NOSOSCF
formula: C10H14NO5PS
InChI: InChI=1/C10H14NO5PS/c1-3-14-17(18,15-4-2)16-10-7-5-9(6-8-10)11(12)13/h5-8H,3-4H2,1-2H3
32 atoms
S  -1.730411 1.253525 -1.873525
P  -1.752162 -0.020442 -0.445683
O  -0.524526 -1.085119 -0.384251
O  -1.669576 0.559698 1.036469
O  -2.98283 -1.012174 -0.530572
O  5.416201 0.739342 -0.729249
O  5.255611 0.401802 1.369932
N  4.787542 0.422389 0.254685
C  0.776922 -0.678391 -0.227291
C  -2.326702 1.78513 1.425315
C  -3.221012 -2.080265 0.421886
C  1.512243 -0.290494 -1.33805
C  1.339363 -0.701552 1.040686
C  3.396362 0.045129 0.088423
C  2.836374 0.073713 -1.180498
C  2.663796 -0.341437 1.201892
C  -3.829459 1.656369 1.440866
C  -4.705528 -2.316838 0.497708
H  -1.943622 1.997547 2.421407
H  -2.004464 2.58828 0.76026
H  -2.695973 -2.968211 0.069168
H  -2.822773 -1.813868 1.401809
H  1.061374 -0.285459 -2.32031
H  0.753213 -1.013107 1.894249
H  3.410672 0.373417 -2.044618
H  3.104642 -0.365614 2.187467
H  -4.254784 2.570889 1.854616
H  -4.243625 1.527659 0.440449
H  -4.154942 0.824954 2.066165
H  -5.231236 -1.43934 0.874494
H  -5.120323 -2.584261 -0.47399
H  -4.898314 -3.143558 1.181219
elementType: S P O N C H
totalener: -1560.03941287 hartree
nucrepener: 1668.38096601 hartree
electener: -3228.42037888 hartree
oneelecener: -5458.86263161 hartree
twoeener: 2230.44225273 hartree
cpcmener: -0.02891553 hartree
kineticenergy: 1555.24548728 hartree
xcener: -112.194716581892 hartree
chargesum: 0.0000000
charge: -0.428423 0.715773 -0.349188 -0.334533 -0.340844 -0.395792 -0.395933 0.545261 0.261713 0.037912 0.020180 -0.151562 -0.148435 0.047131 -0.115041 -0.112218 -0.248625 -0.239387 0.109076 0.097513 0.113726 0.113608 0.155569 0.159570 0.165862 0.165291 0.106983 0.083968 0.092085 0.085814 0.090795 0.092151
qa: -0.4284 0.7158 -0.3492 -0.3345 -0.3408 -0.3958 -0.3959 0.5453 0.2617 0.0379 0.0202 -0.1516 -0.1484 0.0471 -0.1150 -0.1122 -0.2486 -0.2394 0.1091 0.0975 0.1137 0.1136 0.1556 0.1596 0.1659 0.1653 0.1070 0.0840 0.0921 0.0858 0.0908 0.0922
va: 2.0284 5.5285 2.1010 2.0678 2.1008 1.8595 1.8592 4.1362 3.7719 3.8416 3.8378 4.0343 4.0236 3.7621 4.0508 4.0290 3.9014 3.9480 0.9917 1.0109 0.9962 0.9947 1.0076 1.0005 1.0114 1.0112 1.0105 1.0157 1.0026 1.0050 1.0034 1.0067
dispcorr: -0.015014107 hartree
energy: -1560.054426980401
dipole: -25.40513 22.66808 -2.73705 -3.57025 2.37958 -1.19067 10.44477 -8.52224 1.92254
magnitude: 3.55039 au
magnitude: 9.02438 debye
