program: Orca
programVersion: 5.0.2
elementType: S P O O O O O N C C C C C C C C C C H H H H H H H H H H H H H H
charge: 0
multiplicity: 1
keywords: wb97x-d3
keywords: def2-TZVPP
keywords: def2/J RIJCOSX
keywords: DEFGRID2
keywords: scfconv7
keywords: smallprint printgap noloewdin
keywords: NOSOSCF
formula: C10H14NO5PS
InChI: InChI=1/C10H14NO5PS/c1-3-14-17(18,15-4-2)16-10-7-5-9(6-8-10)11(12)13/h5-8H,3-4H2,1-2H3
32 atoms
S  -1.724737 0.771091 -1.678302
P  -1.801009 0.345449 0.190209
O  -0.502599 0.784149 1.066568
O  -2.955377 1.008854 1.050818
O  -1.897347 -1.186552 0.598039
O  5.105796 -1.70758 0.029797
O  5.306141 0.108544 -1.068814
N  4.67325 -0.651922 -0.372824
C  0.766287 0.41544 0.689861
C  -3.599871 2.255674 0.704717
C  -2.73251 -2.120414 -0.125689
C  1.287071 -0.789812 1.138383
C  1.51348 1.275588 -0.101543
C  3.320419 -0.280259 -0.003411
C  2.577591 -1.141374 0.791242
C  2.804829 0.928007 -0.450274
C  -4.928112 1.992351 0.045393
C  -1.888373 -2.989827 -1.020063
H  -3.72232 2.790504 1.645178
H  -2.951371 2.85229 0.061777
H  -3.241997 -2.708114 0.636412
H  -3.494855 -1.588908 -0.6986
H  0.698495 -1.444754 1.765546
H  1.094757 2.214875 -0.434604
H  2.985256 -2.077834 1.142156
H  3.387976 1.5978 -1.065056
H  -5.426781 2.942334 -0.147542
H  -4.805081 1.476992 -0.906996
H  -5.579245 1.396391 0.684888
H  -1.129703 -3.528396 -0.451721
H  -2.527292 -3.726642 -1.507707
H  -1.395936 -2.404005 -1.796084
elementType: S P O N C H
totalener: -1560.03792962 hartree
nucrepener: 1671.61124111 hartree
electener: -3231.64917073 hartree
oneelecener: -5465.62657411 hartree
twoeener: 2233.97740338 hartree
cpcmener: -0.02584938 hartree
kineticenergy: 1555.25020462 hartree
xcener: -112.196503578136 hartree
chargesum: 0.0000000
charge: -0.446708 0.768546 -0.354089 -0.348644 -0.346706 -0.396355 -0.395916 0.546363 0.248399 0.054486 0.048225 -0.147425 -0.151405 0.047251 -0.112356 -0.109934 -0.236593 -0.241282 0.108257 0.087785 0.108764 0.091101 0.159712 0.156923 0.165519 0.164592 0.097508 0.075706 0.090542 0.090234 0.100810 0.076689
qa: -0.4467 0.7685 -0.3541 -0.3486 -0.3467 -0.3964 -0.3959 0.5464 0.2484 0.0545 0.0482 -0.1474 -0.1514 0.0473 -0.1124 -0.1099 -0.2366 -0.2413 0.1083 0.0878 0.1088 0.0911 0.1597 0.1569 0.1655 0.1646 0.0975 0.0757 0.0905 0.0902 0.1008 0.0767
va: 1.9715 5.4987 2.1140 2.1071 2.1070 1.8589 1.8596 4.1355 3.7926 3.8357 3.8524 4.0101 4.0158 3.7600 4.0345 4.0348 3.9232 3.9238 0.9961 1.0123 0.9969 1.0043 1.0047 1.0034 1.0111 1.0115 1.0086 1.0161 1.0039 1.0034 1.0091 1.0175
dispcorr: -0.014625216 hartree
energy: -1560.052554841342
dipole: -22.66695 19.64282 -3.02413 -2.53518 2.75045 0.21527 -0.79428 1.73634 0.94207
magnitude: 3.17478 au
magnitude: 8.06964 debye
