program: Orca
programVersion: 5.0.2
elementType: S P O O O O O N C C C C C C C C C C H H H H H H H H H H H H H H
charge: 0
multiplicity: 1
keywords: wb97x-d3
keywords: def2-TZVPP
keywords: def2/J RIJCOSX
keywords: DEFGRID2
keywords: scfconv7
keywords: smallprint printgap noloewdin
keywords: NOSOSCF
formula: C10H14NO5PS
InChI: InChI=1/C10H14NO5PS/c1-3-14-17(18,15-4-2)16-10-7-5-9(6-8-10)11(12)13/h5-8H,3-4H2,1-2H3
32 atoms
S  -1.753818 0.07016 -1.911401
P  -1.76219 0.029744 0.003335
O  -0.459044 0.676575 0.733662
O  -2.90565 0.828848 0.755456
O  -1.808282 -1.389646 0.713579
O  5.728976 0.644448 0.245222
O  5.300815 -1.193889 -0.747206
N  4.954255 -0.190641 -0.164488
C  0.849252 0.410276 0.465409
C  -3.424305 2.098261 0.295308
C  -2.556854 -2.499628 0.168368
C  1.763845 1.348173 0.933678
C  1.28196 -0.726559 -0.209354
C  3.539413 0.021095 0.052432
C  3.114482 1.15499 0.732107
C  2.634592 -0.91765 -0.417671
C  -4.926394 2.071548 0.391299
C  -4.047947 -2.288665 0.248672
H  -2.993819 2.874121 0.927692
H  -3.105493 2.281195 -0.732335
H  -2.235591 -2.674742 -0.859822
H  -2.249782 -3.353834 0.768203
H  1.414145 2.227132 1.457944
H  0.595992 -1.477428 -0.572771
H  3.815572 1.888891 1.101382
H  2.962736 -1.802586 -0.942552
H  -5.319226 3.039994 0.081762
H  -5.352803 1.311289 -0.263309
H  -5.262897 1.885877 1.411074
H  -4.368256 -2.06501 1.265939
H  -4.389436 -1.490204 -0.410893
H  -4.546618 -3.205993 -0.064768
elementType: S P O N C H
totalener: -1560.03875951 hartree
nucrepener: 1656.58444017 hartree
electener: -3216.62319968 hartree
oneelecener: -5435.33347257 hartree
twoeener: 2218.71027289 hartree
cpcmener: -0.02675346 hartree
kineticenergy: 1555.25134677 hartree
xcener: -112.199704181990 hartree
chargesum: 0.0000000
charge: -0.434760 0.741202 -0.311178 -0.343145 -0.346765 -0.400587 -0.400678 0.544962 0.276522 0.046631 0.042252 -0.171400 -0.129573 0.038359 -0.103080 -0.138614 -0.240203 -0.240136 0.109505 0.086767 0.096050 0.113243 0.155607 0.136852 0.164827 0.164046 0.094652 0.085544 0.092356 0.093954 0.075464 0.101325
qa: -0.4348 0.7412 -0.3112 -0.3431 -0.3468 -0.4006 -0.4007 0.5450 0.2765 0.0466 0.0423 -0.1714 -0.1296 0.0384 -0.1031 -0.1386 -0.2402 -0.2401 0.1095 0.0868 0.0961 0.1132 0.1556 0.1369 0.1648 0.1640 0.0947 0.0855 0.0924 0.0940 0.0755 0.1013
va: 1.9888 5.5069 2.1831 2.1182 2.0895 1.8531 1.8544 4.1335 3.8085 3.8259 3.8345 3.9997 3.9431 3.7700 4.0415 4.0987 3.9368 3.9161 0.9961 1.0140 1.0082 0.9915 1.0030 1.0193 1.0103 1.0144 1.0085 1.0050 1.0033 1.0059 1.0139 1.0094
dispcorr: -0.014293379 hartree
energy: -1560.053052886399
dipole: -27.36581 24.11337 -3.25244 -0.60765 0.77203 0.16438 3.09581 -2.17222 0.92358
magnitude: 3.38503 au
magnitude: 8.60406 debye
