program: Orca
programVersion: 5.0.2
elementType: S P O O O O O N C C C C C C C C C C H H H H H H H H H H H H H H
charge: 0
multiplicity: 1
keywords: wb97x-d3
keywords: def2-TZVPP
keywords: def2/J RIJCOSX
keywords: DEFGRID2
keywords: scfconv7
keywords: smallprint printgap noloewdin
keywords: NOSOSCF
formula: C10H14NO5PS
InChI: InChI=1/C10H14NO5PS/c1-3-14-17(18,15-4-2)16-10-7-5-9(6-8-10)11(12)13/h5-8H,3-4H2,1-2H3
32 atoms
S  -1.524745 0.510473 -1.684912
P  -1.72211 -0.000227 0.151818
O  -0.480471 0.409667 1.119489
O  -2.924435 0.620514 0.979996
O  -1.851087 -1.549297 0.478226
O  5.445623 0.848619 -0.719401
O  5.335125 -1.248975 -0.349559
N  4.84568 -0.144267 -0.37959
C  0.822606 0.255878 0.728006
C  -3.314828 2.006196 0.840797
C  -2.542231 -2.473912 -0.388455
C  1.515765 1.365719 0.266711
C  1.437029 -0.984287 0.830393
C  3.453911 -0.003122 0.010838
C  2.845559 1.239935 -0.088722
C  2.764618 -1.116641 0.468103
C  -4.553393 2.119671 -0.00902
C  -4.039334 -2.300865 -0.338315
H  -3.493766 2.362454 1.854578
H  -2.496552 2.597168 0.423624
H  -2.163144 -2.364146 -1.406381
H  -2.250557 -3.457999 -0.025838
H  1.021726 2.325135 0.193554
H  0.89219 -1.841357 1.201973
H  3.38499 2.104382 -0.447869
H  3.243057 -2.081961 0.547851
H  -4.365547 1.801947 -1.034536
H  -5.372445 1.526111 0.398393
H  -4.876674 3.161129 -0.034506
H  -4.362082 -1.355057 -0.775183
H  -4.504426 -3.102027 -0.913929
H  -4.416148 -2.361854 0.682819
elementType: S P O N C H
totalener: -1560.04796309 hartree
nucrepener: 1669.34081868 hartree
electener: -3229.38878177 hartree
oneelecener: -5461.04261262 hartree
twoeener: 2231.65383086 hartree
cpcmener: -0.02268776 hartree
kineticenergy: 1555.24962705 hartree
xcener: -112.195229235103 hartree
chargesum: 0.0000000
charge: -0.437014 0.747923 -0.348635 -0.339009 -0.342371 -0.383394 -0.383287 0.530848 0.211115 0.049851 0.030940 -0.135594 -0.115094 0.056719 -0.120465 -0.131575 -0.244154 -0.233078 0.107226 0.091023 0.095459 0.108578 0.157283 0.160350 0.164818 0.163380 0.078887 0.091189 0.099074 0.077622 0.099208 0.092176
qa: -0.4370 0.7479 -0.3486 -0.3390 -0.3424 -0.3834 -0.3833 0.5308 0.2111 0.0499 0.0309 -0.1356 -0.1151 0.0567 -0.1205 -0.1316 -0.2442 -0.2331 0.1072 0.0910 0.0955 0.1086 0.1573 0.1604 0.1648 0.1634 0.0789 0.0912 0.0991 0.0776 0.0992 0.0922
va: 1.9854 5.5139 2.1174 2.1028 2.1247 1.8743 1.8745 4.1618 3.8272 3.8529 3.8593 4.0023 4.0087 3.7451 4.0413 4.0607 3.9231 3.9048 0.9958 1.0048 1.0100 0.9914 0.9967 1.0031 1.0116 1.0132 1.0158 1.0025 1.0102 1.0114 1.0095 1.0059
dispcorr: -0.014807528 hartree
energy: -1560.062770618611
dipole: -26.42672 23.52995 -2.89677 -0.68275 0.67945 -0.00330 0.63931 0.32907 0.96839
magnitude: 3.05435 au
magnitude: 7.76354 debye
