program: Orca
programVersion: 5.0.2
elementType: S P O O O O O N C C C C C C C C C C H H H H H H H H H H H H H H
charge: 0
multiplicity: 1
keywords: wb97x-d3
keywords: def2-TZVPP
keywords: def2/J RIJCOSX
keywords: DEFGRID2
keywords: scfconv7
keywords: smallprint printgap noloewdin
keywords: NOSOSCF
formula: C10H14NO5PS
InChI: InChI=1/C10H14NO5PS/c1-3-14-17(18,15-4-2)16-10-7-5-9(6-8-10)11(12)13/h5-8H,3-4H2,1-2H3
32 atoms
S  -1.801764 0.528021 -1.766068
P  -1.949003 0.114997 0.100122
O  -0.703129 0.59012 1.031476
O  -3.161424 0.758726 0.897242
O  -2.032961 -1.413161 0.521161
O  5.074271 -1.473951 -0.033705
O  5.235879 0.504199 -0.815312
N  4.611143 -0.387128 -0.289835
C  0.596153 0.329472 0.683836
C  -3.743575 2.034238 0.555194
C  -2.765601 -2.39284 -0.248428
C  1.168519 -0.892711 1.009373
C  1.329992 1.31792 0.043196
C  3.220709 -0.138749 0.048531
C  2.492939 -1.129958 0.690484
C  2.655362 1.086508 -0.273561
C  -2.854475 3.196992 0.917223
C  -1.829473 -3.197763 -1.111095
H  -3.99024 2.041866 -0.508181
H  -4.675164 2.067118 1.117428
H  -3.264628 -3.021724 0.487439
H  -3.538029 -1.908908 -0.848977
H  0.593997 -1.652382 1.520967
H  0.873667 2.26809 -0.197948
H  2.937917 -2.080328 0.946983
H  3.226206 1.857983 -0.769344
H  -2.564974 3.171685 1.967708
H  -1.953367 3.234519 0.304407
H  -3.403916 4.123356 0.74524
H  -1.359141 -2.580814 -1.876226
H  -1.049548 -3.673562 -0.516099
H  -2.393999 -3.984748 -1.612613
elementType: S P O N C H
totalener: -1560.04746232 hartree
nucrepener: 1680.97192628 hartree
electener: -3241.01938860 hartree
oneelecener: -5484.29379488 hartree
twoeener: 2243.27440628 hartree
cpcmener: -0.02232995 hartree
kineticenergy: 1555.24926890 hartree
xcener: -112.195807674952 hartree
chargesum: -0.0000000
charge: -0.439067 0.750512 -0.344182 -0.341928 -0.344545 -0.383490 -0.383296 0.531494 0.231825 0.032061 0.040983 -0.134945 -0.138920 0.052849 -0.122876 -0.119421 -0.234059 -0.242915 0.094749 0.110208 0.107612 0.093093 0.159066 0.159246 0.164712 0.164571 0.091575 0.076384 0.099209 0.080563 0.088395 0.100540
qa: -0.4391 0.7505 -0.3442 -0.3419 -0.3445 -0.3835 -0.3833 0.5315 0.2318 0.0321 0.0410 -0.1349 -0.1389 0.0528 -0.1229 -0.1194 -0.2341 -0.2429 0.0947 0.1102 0.1076 0.0931 0.1591 0.1592 0.1647 0.1646 0.0916 0.0764 0.0992 0.0806 0.0884 0.1005
va: 1.9828 5.5098 2.1022 2.1211 2.1169 1.8747 1.8747 4.1625 3.8188 3.8567 3.8517 4.0101 3.9996 3.7532 4.0540 4.0448 3.8955 3.9203 1.0109 0.9918 0.9961 1.0061 1.0056 0.9911 1.0121 1.0129 1.0065 1.0132 1.0095 1.0171 1.0036 1.0093
dispcorr: -0.015026703 hartree
energy: -1560.062489027732
dipole: -17.38796 14.58902 -2.79894 -0.30464 0.40602 0.10138 0.84086 0.04985 0.89071
magnitude: 2.93900 au
magnitude: 7.47034 debye
