program: Orca
programVersion: 5.0.2
elementType: S P O O O O O N C C C C C C C C C C H H H H H H H H H H H H H H
charge: 0
multiplicity: 1
keywords: wb97x-d3
keywords: def2-TZVPP
keywords: def2/J RIJCOSX
keywords: DEFGRID2
keywords: scfconv7
keywords: smallprint printgap noloewdin
keywords: NOSOSCF
formula: C10H14NO5PS
InChI: InChI=1/C10H14NO5PS/c1-3-14-17(18,15-4-2)16-10-7-5-9(6-8-10)11(12)13/h5-8H,3-4H2,1-2H3
32 atoms
S  -1.685322 0.081712 -1.878455
P  -1.75442 -0.073713 0.030112
O  -0.43596 -0.722567 0.731866
O  -1.89257 1.255192 0.885819
O  -2.869426 -1.006174 0.660824
O  5.744933 -0.497823 0.218793
O  5.265214 1.406267 -0.613454
N  4.950235 0.349663 -0.116338
C  0.861731 -0.406525 0.480981
C  -2.717954 2.365264 0.474128
C  -3.249928 -2.273161 0.07505
C  1.80092 -1.374063 0.824272
C  1.265757 0.810532 -0.058719
C  3.540913 0.085077 0.089717
C  3.145337 -1.129534 0.634438
C  2.611463 1.052731 -0.258761
C  -4.192179 2.056129 0.557474
C  -4.551429 -2.141503 -0.673505
H  -2.449707 3.170055 1.155799
H  -2.432881 2.670633 -0.534682
H  -2.457963 -2.6492 -0.576422
H  -3.342875 -2.964124 0.912425
H  1.475422 -2.317142 1.243159
H  0.558586 1.584319 -0.320954
H  3.866226 -1.887102 0.906022
H  2.917126 1.999843 -0.679353
H  -4.752033 2.971839 0.364649
H  -4.505863 1.320614 -0.18399
H  -4.471226 1.696707 1.548084
H  -4.853759 -3.123787 -1.038634
H  -5.346839 -1.766384 -0.028608
H  -4.454317 -1.479138 -1.533795
elementType: S P O N C H
totalener: -1560.04755056 hartree
nucrepener: 1661.78744085 hartree
electener: -3221.83499141 hartree
oneelecener: -5445.75001054 hartree
twoeener: 2223.91501913 hartree
cpcmener: -0.02278822 hartree
kineticenergy: 1555.24684163 hartree
xcener: -112.198105150968 hartree
chargesum: -0.0000000
charge: -0.428465 0.734146 -0.308804 -0.338922 -0.340024 -0.387369 -0.387278 0.530311 0.265383 0.036306 0.044768 -0.164359 -0.125598 0.035797 -0.105827 -0.136539 -0.237866 -0.244190 0.110998 0.093874 0.092010 0.107407 0.151607 0.134581 0.163231 0.162600 0.099293 0.078110 0.093615 0.100212 0.091210 0.079784
qa: -0.4285 0.7341 -0.3088 -0.3389 -0.3400 -0.3874 -0.3873 0.5303 0.2654 0.0363 0.0448 -0.1644 -0.1256 0.0358 -0.1058 -0.1365 -0.2379 -0.2442 0.1110 0.0939 0.0920 0.1074 0.1516 0.1346 0.1632 0.1626 0.0993 0.0781 0.0936 0.1002 0.0912 0.0798
va: 1.9898 5.5143 2.1800 2.1025 2.1130 1.8693 1.8705 4.1609 3.8222 3.8495 3.8514 3.9963 3.9408 3.7731 4.0453 4.0957 3.9168 3.9193 0.9909 1.0086 1.0075 0.9962 1.0043 1.0216 1.0114 1.0153 1.0100 1.0105 1.0057 1.0100 1.0023 1.0158
dispcorr: -0.014599997 hartree
energy: -1560.062150557247
dipole: -26.88760 23.73225 -3.15535 -0.65078 0.27084 -0.37994 1.37132 -0.50255 0.86877
magnitude: 3.29474 au
magnitude: 8.37457 debye
