program: Orca
programVersion: 5.0.2
elementType: S P O O O O O N C C C C C C C C C C H H H H H H H H H H H H H H
charge: 0
multiplicity: 1
keywords: wb97x-d3
keywords: def2-TZVPP
keywords: def2/J RIJCOSX
keywords: DEFGRID2
keywords: scfconv7
keywords: smallprint printgap noloewdin
keywords: NOSOSCF
formula: C10H14NO5PS
InChI: InChI=1/C10H14NO5PS/c1-3-14-17(18,15-4-2)16-10-7-5-9(6-8-10)11(12)13/h5-8H,3-4H2,1-2H3
32 atoms
S  -1.718579 0.778299 -1.683886
P  -1.78938 0.341493 0.182356
O  -0.494566 0.785219 1.059585
O  -2.951149 0.989286 1.045353
O  -1.87153 -1.192154 0.584444
O  5.117378 -1.700876 0.039513
O  5.317345 0.114084 -1.061992
N  4.687545 -0.646006 -0.364763
C  0.774445 0.421693 0.692289
C  -3.597026 2.237278 0.710835
C  -2.73981 -2.120024 -0.10463
C  1.302828 -0.774756 1.156266
C  1.520761 1.275815 -0.106889
C  3.334954 -0.271333 0.008182
C  2.595274 -1.124759 0.813914
C  2.813962 0.929832 -0.450929
C  -4.915173 1.980367 0.027594
C  -1.94399 -2.983949 -1.048554
H  -3.736301 2.755749 1.658846
H  -2.942754 2.849919 0.088218
H  -3.209473 -2.715588 0.677937
H  -3.533301 -1.58593 -0.632859
H  0.717087 -1.425417 1.791053
H  1.098631 2.209509 -0.451968
H  3.007435 -2.055608 1.175335
H  3.394638 1.594112 -1.074481
H  -5.417324 2.931125 -0.154849
H  -4.776741 1.483868 -0.933055
H  -5.572549 1.368688 0.646432
H  -1.149023 -3.518236 -0.526426
H  -2.605542 -3.725559 -1.498264
H  -1.501177 -2.396153 -1.852875
elementType: S P O N C H
totalener: -1560.04704423 hartree
nucrepener: 1671.15513859 hartree
electener: -3231.20218282 hartree
oneelecener: -5464.68283883 hartree
twoeener: 2233.48065602 hartree
cpcmener: -0.02203180 hartree
kineticenergy: 1555.24816108 hartree
xcener: -112.195152214116 hartree
chargesum: 0.0000000
charge: -0.441303 0.757746 -0.348588 -0.341092 -0.338776 -0.383806 -0.383391 0.531934 0.243226 0.051980 0.042151 -0.143024 -0.146471 0.045018 -0.115498 -0.112358 -0.236985 -0.237538 0.106779 0.087200 0.107223 0.090488 0.155871 0.153177 0.163983 0.163347 0.096364 0.076868 0.090013 0.088743 0.098152 0.078567
qa: -0.4413 0.7577 -0.3486 -0.3411 -0.3388 -0.3838 -0.3834 0.5319 0.2432 0.0520 0.0422 -0.1430 -0.1465 0.0450 -0.1155 -0.1124 -0.2370 -0.2375 0.1068 0.0872 0.1072 0.0905 0.1559 0.1532 0.1640 0.1633 0.0964 0.0769 0.0900 0.0887 0.0982 0.0786
va: 1.9769 5.5112 2.1215 2.1124 2.1139 1.8739 1.8746 4.1614 3.8069 3.8410 3.8645 4.0086 4.0135 3.7642 4.0373 4.0391 3.9215 3.9255 0.9957 1.0120 0.9960 1.0024 1.0059 1.0048 1.0122 1.0124 1.0091 1.0168 1.0036 1.0035 1.0093 1.0175
dispcorr: -0.014600399 hartree
energy: -1560.061644626368
dipole: -22.86845 19.91956 -2.94889 -2.56439 2.75912 0.19473 -0.79573 1.73898 0.94325
magnitude: 3.10219 au
magnitude: 7.88514 debye
