program: Orca
programVersion: 5.0.2
elementType: S P O O O O O N C C C C C C C C C C H H H H H H H H H H H H H H
charge: 0
multiplicity: 1
keywords: wb97x-d3
keywords: def2-TZVPP
keywords: def2/J RIJCOSX
keywords: DEFGRID2
keywords: scfconv7
keywords: smallprint printgap noloewdin
keywords: NOSOSCF
formula: C10H14NO5PS
InChI: InChI=1/C10H14NO5PS/c1-3-14-17(18,15-4-2)16-10-7-5-9(6-8-10)11(12)13/h5-8H,3-4H2,1-2H3
32 atoms
S  -2.087746 0.612787 -1.772029
P  -1.951101 0.387131 0.125821
O  -0.628613 1.035692 0.824293
O  -3.068147 1.054308 1.029143
O  -1.914798 -1.09892 0.688604
O  4.936707 -1.727075 0.573684
O  4.994523 -0.631631 -1.264435
N  4.459121 -0.974365 -0.239273
C  0.615767 0.543439 0.545302
C  -3.781137 2.236689 0.634057
C  -2.009233 -2.265642 -0.144363
C  1.215736 -0.310897 1.460553
C  1.271239 0.911085 -0.622046
C  3.128757 -0.44003 0.037884
C  2.482749 -0.803716 1.209648
C  2.538014 0.41733 -0.876989
C  -5.145654 1.875775 0.099689
C  -0.651654 -2.708055 -0.636288
H  -3.853803 2.850661 1.531519
H  -3.213234 2.797817 -0.111425
H  -2.468323 -3.026705 0.485691
H  -2.679042 -2.070312 -0.983983
H  0.691016 -0.583736 2.3656
H  0.791493 1.577477 -1.324569
H  2.958306 -1.467815 1.916158
H  3.055203 0.695801 -1.783151
H  -5.718622 1.306406 0.830914
H  -5.70201 2.78437 -0.131526
H  -5.061792 1.290167 -0.814946
H  -0.758097 -3.627281 -1.213228
H  -0.2015 -1.958786 -1.287552
H  0.030488 -2.906776 0.189392
totalener: -1560.03058280 hartree
nucrepener: 1691.88715616 hartree
electener: -3251.91773895 hartree
oneelecener: -5505.78579571 hartree
twoeener: 2253.86805676 hartree
kineticenergy: 1555.29277983 hartree
xcener: -112.203624016101 hartree
chargesum: 0.0000000
charge: -0.395429 0.704539 -0.324359 -0.311568 -0.318773 -0.335553 -0.334052 0.493503 0.227769 0.025446 0.034859 -0.143692 -0.112226 -0.003119 -0.108880 -0.114075 -0.221458 -0.241034 0.097085 0.082330 0.099912 0.089486 0.136065 0.136065 0.157242 0.157648 0.086993 0.082227 0.082377 0.097166 0.086226 0.087282
qa: -0.3954 0.7045 -0.3244 -0.3116 -0.3188 -0.3356 -0.3341 0.4935 0.2278 0.0254 0.0349 -0.1437 -0.1122 -0.0031 -0.1089 -0.1141 -0.2215 -0.2410 0.0971 0.0823 0.0999 0.0895 0.1361 0.1361 0.1572 0.1576 0.0870 0.0822 0.0824 0.0972 0.0862 0.0873
va: 2.0210 5.5336 2.1282 2.1472 2.1211 1.9169 1.9182 4.1928 3.8513 3.8863 3.8577 3.9800 3.9944 3.8713 4.0184 4.0713 3.9194 3.9071 0.9945 1.0124 0.9928 1.0164 1.0111 1.0156 1.0163 1.0177 1.0049 1.0115 1.0202 1.0157 1.0121 1.0039
dispcorr: -0.015670444 hartree
energy: -1560.046253239062
dipole: -17.93556 16.06966 -1.86589 -2.04388 2.27142 0.22754 -0.07255 0.63471 0.56216
magnitude: 1.96198 au
magnitude: 4.98695 debye
