program: Orca
programVersion: 5.0.2
elementType: S P O O O O O N C C C C C C C C C C H H H H H H H H H H H H H H
charge: 0
multiplicity: 1
keywords: wb97x-d3
keywords: def2-TZVPP
keywords: def2/J RIJCOSX
keywords: DEFGRID2
keywords: scfconv7
keywords: smallprint printgap noloewdin
keywords: NOSOSCF
formula: C10H14NO5PS
InChI: InChI=1/C10H14NO5PS/c1-3-14-17(18,15-4-2)16-10-7-5-9(6-8-10)11(12)13/h5-8H,3-4H2,1-2H3
32 atoms
S  -1.696984 -0.569265 -1.716337
P  -1.737707 -0.317775 0.180396
O  -0.446198 -0.86445 1.001766
O  -1.804097 1.17745 0.718712
O  -2.898723 -1.035565 0.992324
O  5.230619 1.58698 0.338855
O  5.313928 0.060162 -1.158108
N  4.752331 0.669481 -0.281608
C  0.8210 -0.475254 0.665939
C  -2.415442 2.236334 -0.031744
C  -3.471965 -2.284069 0.575566
C  1.41192 0.57437 1.354589
C  1.508352 -1.152657 -0.330821
C  3.388359 0.269844 0.049987
C  2.707534 0.947878 1.049009
C  2.802586 -0.779201 -0.640852
C  -3.923736 2.143112 -0.038585
C  -4.79022 -2.055334 -0.124091
H  -2.082621 3.150557 0.457757
H  -2.020981 2.233195 -1.050162
H  -2.783131 -2.827191 -0.075259
H  -3.601625 -2.867688 1.486568
H  0.860956 1.088526 2.129718
H  1.030398 -1.963932 -0.861048
H  3.178639 1.761168 1.580728
H  3.346045 -1.299021 -1.415702
H  -4.32532 2.09589 0.973031
H  -4.338083 3.025668 -0.526544
H  -4.269281 1.270056 -0.592298
H  -4.646626 -1.5122 -1.057274
H  -5.251085 -3.01451 -0.361296
H  -5.481452 -1.496993 0.506682
totalener: -1560.03192780 hartree
nucrepener: 1672.61324819 hartree
electener: -3232.64517599 hartree
oneelecener: -5467.33399236 hartree
twoeener: 2234.68881636 hartree
kineticenergy: 1555.29972375 hartree
xcener: -112.203711830994 hartree
chargesum: -0.0000000
charge: -0.386421 0.700713 -0.334521 -0.323995 -0.306882 -0.336425 -0.334773 0.492642 0.224900 0.018111 0.039704 -0.122374 -0.106170 -0.016793 -0.102736 -0.108012 -0.222661 -0.241557 0.095418 0.096499 0.082598 0.097113 0.133372 0.130460 0.155215 0.156170 0.092052 0.088277 0.077052 0.083671 0.089628 0.089724
qa: -0.3864 0.7007 -0.3345 -0.3240 -0.3069 -0.3364 -0.3348 0.4926 0.2249 0.0181 0.0397 -0.1224 -0.1062 -0.0168 -0.1027 -0.1080 -0.2227 -0.2416 0.0954 0.0965 0.0826 0.0971 0.1334 0.1305 0.1552 0.1562 0.0921 0.0883 0.0771 0.0837 0.0896 0.0897
va: 2.0340 5.5451 2.1399 2.1329 2.1199 1.9158 1.9176 4.1944 3.8867 3.8922 3.8713 4.0216 4.0114 3.8976 4.0430 4.0676 3.9006 3.9143 0.9923 1.0107 1.0116 0.9953 1.0118 1.0145 1.0176 1.0179 1.0064 1.0123 1.0147 1.0169 1.0147 1.0018
dispcorr: -0.014707099 hartree
energy: -1560.046634899556
dipole: -26.39588 24.07508 -2.32080 0.45553 -0.66797 -0.21244 0.67759 -0.03582 0.64177
magnitude: 2.41726 au
magnitude: 6.14418 debye
