program: Orca
programVersion: 5.0.2
elementType: S P O O O O O N C C C C C C C C C C H H H H H H H H H H H H H H
charge: 0
multiplicity: 1
keywords: wb97x-d3
keywords: def2-TZVPP
keywords: def2/J RIJCOSX
keywords: DEFGRID2
keywords: scfconv7
keywords: smallprint printgap noloewdin
keywords: NOSOSCF
formula: C10H14NO5PS
InChI: InChI=1/C10H14NO5PS/c1-3-14-17(18,15-4-2)16-10-7-5-9(6-8-10)11(12)13/h5-8H,3-4H2,1-2H3
32 atoms
S  -2.075482 0.338621 -1.934933
P  -1.802061 0.725313 -0.079345
O  -0.430929 1.489654 0.332078
O  -2.783196 1.768899 0.603823
O  -1.786071 -0.534735 0.90227
O  4.931373 -1.572294 1.050981
O  4.996962 -1.212454 -1.057837
N  4.474444 -1.12952 0.025959
C  0.767272 0.839336 0.243569
C  -4.154601 1.883659 0.20556
C  -1.905939 -1.896612 0.465537
C  1.340087 0.330351 1.400526
C  1.401778 0.712234 -0.983942
C  3.188622 -0.442649 0.102752
C  2.56256 -0.31105 1.332742
C  2.622828 0.066597 -1.05509
C  -4.981884 0.676036 0.588523
C  -0.573803 -2.486963 0.067924
H  -4.514165 2.776775 0.714243
H  -4.205627 2.061302 -0.871081
H  -2.332117 -2.428453 1.315752
H  -2.613953 -1.959116 -0.363565
H  0.829378 0.441074 2.346961
H  0.941031 1.116965 -1.874115
H  3.018457 -0.709469 2.227038
H  3.125307 -0.038668 -2.005034
H  -4.881826 0.441885 1.64758
H  -6.033505 0.879538 0.386257
H  -4.705147 -0.203372 0.006863
H  -0.165635 -1.991191 -0.812354
H  0.154233 -2.419813 0.875312
H  -0.705492 -3.541246 -0.177424
totalener: -1560.03026490 hartree
nucrepener: 1702.91078108 hartree
electener: -3262.94104598 hartree
oneelecener: -5527.72659065 hartree
twoeener: 2264.78554467 hartree
kineticenergy: 1555.30190736 hartree
xcener: -112.206753392038 hartree
chargesum: 0.0000000
charge: -0.387380 0.680599 -0.316976 -0.304769 -0.320267 -0.335502 -0.333785 0.494499 0.216298 0.020705 0.032623 -0.123844 -0.121954 0.006622 -0.127017 -0.110080 -0.238305 -0.242571 0.099135 0.095529 0.101176 0.089507 0.134701 0.141963 0.156165 0.158178 0.094445 0.089999 0.076972 0.086498 0.088723 0.098115
qa: -0.3874 0.6806 -0.3170 -0.3048 -0.3203 -0.3355 -0.3338 0.4945 0.2163 0.0207 0.0326 -0.1238 -0.1220 0.0066 -0.1270 -0.1101 -0.2383 -0.2426 0.0991 0.0955 0.1012 0.0895 0.1347 0.1420 0.1562 0.1582 0.0944 0.0900 0.0770 0.0865 0.0887 0.0981
va: 2.0330 5.5534 2.1500 2.1508 2.0856 1.9164 1.9185 4.1921 3.8560 3.8808 3.8502 3.9666 3.9891 3.8550 4.0219 4.0592 3.8918 3.9263 0.9923 1.0119 0.9908 1.0121 1.0111 1.0100 1.0172 1.0173 1.0057 1.0120 1.0149 1.0118 1.0030 1.0157
dispcorr: -0.016456299 hartree
energy: -1560.046721197723
dipole: -18.96001 16.92474 -2.03526 -6.03564 6.10944 0.07380 3.48350 -2.82185 0.66165
magnitude: 2.14138 au
magnitude: 5.44296 debye
