program: Orca
programVersion: 5.0.2
elementType: S P O O O O O N C C C C C C C C H H H H H H H H H H
charge: 0
multiplicity: 1
keywords: wb97x-d3
keywords: def2-TZVPP
keywords: def2/J RIJCOSX
keywords: DEFGRID2
keywords: scfconv7
keywords: smallprint printgap noloewdin
keywords: NOSOSCF
formula: C8H10NO5PS
InChI: InChI=1/C8H10NO5PS/c1-12-15(16,13-2)14-8-5-3-7(4-6-8)9(10)11/h3-6H,1-2H3
26 atoms
S  -1.9801 -0.215747 1.884144
P  -2.199468 -0.035482 -0.009556
O  -1.007876 0.740124 -0.790315
O  -2.277974 -1.370838 -0.871731
O  -3.46422 0.773567 -0.531213
O  4.927746 -1.102551 -0.464225
O  4.965747 0.50791 0.933112
N  4.391257 -0.202432 0.140271
C  0.317585 0.482591 -0.538791
C  0.962694 -0.523188 -1.243045
C  0.991245 1.264043 0.387856
C  2.979406 0.034941 -0.094811
C  2.307902 -0.749308 -1.021569
C  2.336893 1.042849 0.610438
C  -3.122661 -2.459381 -0.471281
C  -3.851741 2.022538 0.057298
H  0.426255 -1.117412 -1.96991
H  0.472371 2.046863 0.923374
H  2.81277 -1.528638 -1.573048
H  2.863649 1.65103 1.330946
H  -4.172582 -2.201791 -0.607679
H  -2.945335 -2.73306 0.568597
H  -2.87139 -3.299976 -1.111699
H  -4.832074 2.264718 -0.343766
H  -3.147535 2.809755 -0.210996
H  -3.916075 1.94378 1.142294
elementType: S P O N C H
totalener: -1481.39370110 hartree
nucrepener: 1396.99381079 hartree
electener: -2878.38751189 hartree
oneelecener: -4812.58681235 hartree
twoeener: 1934.19930046 hartree
cpcmener: -0.02602270 hartree
kineticenergy: 1477.01439841 hartree
xcener: -103.838208070550 hartree
chargesum: 0.0000000
charge: -0.443661 0.766406 -0.349824 -0.339250 -0.338815 -0.396032 -0.395896 0.546435 0.233946 -0.125717 -0.141178 0.054421 -0.124208 -0.113897 -0.110521 -0.107144 0.162418 0.157898 0.165214 0.165803 0.128364 0.108227 0.129268 0.131420 0.129079 0.107244
qa: -0.4437 0.7664 -0.3498 -0.3393 -0.3388 -0.3960 -0.3959 0.5464 0.2339 -0.1257 -0.1412 0.0544 -0.1242 -0.1139 -0.1105 -0.1071 0.1624 0.1579 0.1652 0.1658 0.1284 0.1082 0.1293 0.1314 0.1291 0.1072
va: 1.9972 5.4985 2.1041 2.1188 2.1079 1.8593 1.8593 4.1354 3.7871 4.0293 4.0049 3.7486 4.0516 4.0359 3.8383 3.8299 1.0028 1.0007 1.0116 1.0107 0.9871 1.0015 0.9890 0.9893 0.9868 1.0025
dispcorr: -0.010845489 hartree
energy: -1481.404546587773
dipole: -12.26527 9.39538 -2.86989 0.03302 0.36951 0.40253 -1.96474 1.00203 -0.96271
magnitude: 3.05370 au
magnitude: 7.76190 debye
