program: Orca
programVersion: 5.0.2
elementType: S P O O O O O N C C C C C C C C H H H H H H H H H H
charge: 0
multiplicity: 1
keywords: wb97x-d3
keywords: def2-TZVPP
keywords: def2/J RIJCOSX
keywords: DEFGRID2
keywords: scfconv7
keywords: smallprint printgap noloewdin
keywords: NOSOSCF
formula: C8H10NO5PS
InChI: InChI=1/C8H10NO5PS/c1-12-15(16,13-2)14-8-5-3-7(4-6-8)9(10)11/h3-6H,1-2H3
26 atoms
S  -2.15631 -0.630619 2.031024
P  -2.328744 -0.018396 0.230802
O  -1.058661 -0.341356 -0.74431
O  -3.489564 -0.620871 -0.66884
O  -2.572202 1.542614 0.115584
O  5.13606 -0.471618 -0.566094
O  4.793343 1.044599 0.893756
N  4.399443 0.23288 0.086796
C  0.262601 -0.16741 -0.477049
C  1.138416 -0.969489 -1.201171
C  0.741597 0.771099 0.430344
C  2.972102 0.095291 -0.10875
C  2.499261 -0.837853 -1.022198
C  2.105359 0.899131 0.616192
C  -3.688471 -2.03481 -0.801328
C  -2.73736 2.215589 -1.14665
H  0.751114 -1.693038 -1.905652
H  0.078569 1.418635 0.98638
H  3.171973 -1.463275 -1.590406
H  2.471359 1.630155 1.322026
H  -3.673441 -2.526689 0.171264
H  -2.924879 -2.471352 -1.444262
H  -4.665306 -2.170942 -1.25655
H  -3.720379 2.007335 -1.565132
H  -1.964792 1.930707 -1.859832
H  -2.651922 3.278363 -0.939499
elementType: S P O N C H
totalener: -1481.39396686 hartree
nucrepener: 1394.66862028 hartree
electener: -2876.06258714 hartree
oneelecener: -4807.48215780 hartree
twoeener: 1931.41957066 hartree
cpcmener: -0.02940933 hartree
kineticenergy: 1477.00593077 hartree
xcener: -103.839563568702 hartree
chargesum: -0.0000000
charge: -0.418158 0.718235 -0.310537 -0.335205 -0.340228 -0.400385 -0.400168 0.545536 0.265152 -0.158786 -0.113138 0.037505 -0.108397 -0.129014 -0.102573 -0.114845 0.156582 0.135277 0.164956 0.164119 0.104822 0.128184 0.129906 0.126576 0.125283 0.129301
qa: -0.4182 0.7182 -0.3105 -0.3352 -0.3402 -0.4004 -0.4002 0.5455 0.2652 -0.1588 -0.1131 0.0375 -0.1084 -0.1290 -0.1026 -0.1148 0.1566 0.1353 0.1650 0.1641 0.1048 0.1282 0.1299 0.1266 0.1253 0.1293
va: 2.0308 5.5113 2.1074 2.1047 2.0922 1.8536 1.8553 4.1347 3.8020 3.9962 3.9242 3.7676 4.0435 4.0734 3.8329 3.8338 1.0003 1.0259 1.0104 1.0135 1.0021 0.9887 0.9888 0.9925 0.9915 0.9887
dispcorr: -0.011159921 hartree
energy: -1481.405126785086
dipole: -9.83557 7.27899 -2.55659 -0.02038 -0.04079 -0.06117 -8.03114 5.65011 -2.38103
magnitude: 3.49417 au
magnitude: 8.88147 debye
