program: Orca
programVersion: 5.0.2
elementType: S P O O O O O N C C C C C C C C H H H H H H H H H H
charge: 0
multiplicity: 1
keywords: wb97x-d3
keywords: def2-TZVPP
keywords: def2/J RIJCOSX
keywords: DEFGRID2
keywords: scfconv7
keywords: smallprint printgap noloewdin
keywords: NOSOSCF
formula: C8H10NO5PS
InChI: InChI=1/C8H10NO5PS/c1-12-15(16,13-2)14-8-5-3-7(4-6-8)9(10)11/h3-6H,1-2H3
26 atoms
S  -2.320322 -1.366337 1.589106
P  -2.235164 -0.033612 0.220774
O  -1.044609 1.065022 0.338362
O  -1.97869 -0.546198 -1.266948
O  -3.502386 0.918201 0.206452
O  4.886467 0.031443 -1.220852
O  4.891192 -0.763431 0.757959
N  4.336235 -0.231912 -0.176161
C  0.276898 0.716551 0.213983
C  0.951985 0.168962 1.295414
C  0.918721 0.960439 -0.991324
C  2.931705 0.103724 -0.037853
C  2.292875 -0.142062 1.169003
C  2.26105 0.659756 -1.118457
C  -2.546204 -1.764303 -1.766781
C  -3.646095 2.006998 -0.723039
H  0.44164 -0.002428 2.232881
H  0.376751 1.392149 -1.821731
H  2.820388 -0.570241 2.008846
H  2.762416 0.850565 -2.055939
H  -3.595172 -1.619514 -2.02461
H  -2.457102 -2.568597 -1.035332
H  -1.984844 -2.027884 -2.660532
H  -4.690304 2.304544 -0.68743
H  -3.398626 1.705771 -1.740083
H  -3.021955 2.848091 -0.426219
elementType: S P O N C H
totalener: -1481.39267047 hartree
nucrepener: 1400.86381139 hartree
electener: -2882.25648185 hartree
oneelecener: -4820.08319024 hartree
twoeener: 1937.82670838 hartree
cpcmener: -0.02853827 hartree
kineticenergy: 1477.01013467 hartree
xcener: -103.837894471725 hartree
chargesum: 0.0000000
charge: -0.430019 0.732064 -0.350934 -0.328967 -0.339894 -0.395607 -0.395576 0.545055 0.264039 -0.142234 -0.149797 0.049924 -0.121442 -0.112791 -0.098395 -0.111126 0.157450 0.158694 0.165414 0.165478 0.128426 0.110179 0.125977 0.129771 0.122475 0.121837
qa: -0.4300 0.7321 -0.3509 -0.3290 -0.3399 -0.3956 -0.3956 0.5451 0.2640 -0.1422 -0.1498 0.0499 -0.1214 -0.1128 -0.0984 -0.1111 0.1574 0.1587 0.1654 0.1655 0.1284 0.1102 0.1260 0.1298 0.1225 0.1218
va: 2.0286 5.5123 2.0896 2.0704 2.1114 1.8596 1.8597 4.1367 3.7670 4.0325 4.0232 3.7591 4.0654 4.0272 3.8235 3.8404 1.0053 0.9996 1.0118 1.0108 0.9848 1.0062 0.9896 0.9897 0.9917 0.9911
dispcorr: -0.011157238 hartree
energy: -1481.403827706208
dipole: -9.74545 7.42044 -2.32501 2.31093 -1.12948 1.18145 -8.11201 6.21338 -1.89863
magnitude: 3.22588 au
magnitude: 8.19952 debye
