program: Orca
programVersion: 5.0.2
elementType: S P O O O O O N C C C C C C C C H H H H H H H H H H
charge: 0
multiplicity: 1
keywords: wb97x-d3
keywords: def2-TZVPP
keywords: def2/J RIJCOSX
keywords: DEFGRID2
keywords: scfconv7
keywords: smallprint printgap noloewdin
keywords: NOSOSCF
formula: C8H10NO5PS
InChI: InChI=1/C8H10NO5PS/c1-12-15(16,13-2)14-8-5-3-7(4-6-8)9(10)11/h3-6H,1-2H3
26 atoms
S  -2.453341 -1.218286 1.711859
P  -2.292711 -0.04554 0.213135
O  -0.998146 0.93407 0.161296
O  -2.168206 -0.713885 -1.22955
O  -3.451228 1.032145 0.151067
O  5.195482 0.836704 -0.118191
O  4.824611 -1.261036 -0.216769
N  4.448863 -0.114526 -0.134555
C  0.315958 0.599385 0.094405
C  1.204937 1.670299 0.094941
C  0.784566 -0.708618 0.028585
C  3.024389 0.133873 -0.050043
C  2.562634 1.441499 0.022169
C  2.145933 -0.938111 -0.045371
C  -2.884864 -1.90833 -1.566493
C  -3.531004 2.045709 -0.863811
H  0.827792 2.682863 0.14926
H  0.121033 -1.561456 0.038912
H  3.242575 2.281105 0.020266
H  2.502133 -1.95655 -0.09863
H  -3.960986 -1.734136 -1.5694
H  -2.649424 -2.715965 -0.873704
H  -2.564912 -2.187803 -2.5669
H  -2.852674 2.867007 -0.636676
H  -4.553887 2.413191 -0.852509
H  -3.309527 1.649784 -1.854713
elementType: S P O N C H
totalener: -1481.39940596 hartree
nucrepener: 1392.33006703 hartree
electener: -2873.72947299 hartree
oneelecener: -4802.80861334 hartree
twoeener: 1929.07914035 hartree
cpcmener: -0.02492634 hartree
kineticenergy: 1477.01214979 hartree
xcener: -103.840479643757 hartree
chargesum: 0.0000000
charge: -0.411588 0.704840 -0.299688 -0.328457 -0.331242 -0.387559 -0.387273 0.530314 0.293482 -0.173481 -0.124241 0.029076 -0.103433 -0.139940 -0.108975 -0.112597 0.152892 0.125872 0.164166 0.163316 0.131726 0.113523 0.129742 0.120510 0.127806 0.121209
qa: -0.4116 0.7048 -0.2997 -0.3285 -0.3312 -0.3876 -0.3873 0.5303 0.2935 -0.1735 -0.1242 0.0291 -0.1034 -0.1399 -0.1090 -0.1126 0.1529 0.1259 0.1642 0.1633 0.1317 0.1135 0.1297 0.1205 0.1278 0.1212
va: 2.0320 5.5288 2.1714 2.0509 2.1293 1.8688 1.8707 4.1602 3.8032 3.9959 3.9512 3.7855 4.0400 4.1179 3.8228 3.8440 1.0029 1.0288 1.0113 1.0145 0.9876 1.0024 0.9908 0.9906 0.9900 0.9922
dispcorr: -0.011032899 hartree
energy: -1481.410438858371
dipole: -10.09967 7.57954 -2.52013 1.68636 -0.82921 0.85715 -8.11705 6.21296 -1.90410
magnitude: 3.27282 au
magnitude: 8.31885 debye
