program: Orca
programVersion: 5.0.2
elementType: S P O O O O O N C C C C C C C C H H H H H H H H H H
charge: 0
multiplicity: 1
keywords: wb97x-d3
keywords: def2-TZVPP
keywords: def2/J RIJCOSX
keywords: DEFGRID2
keywords: scfconv7
keywords: smallprint printgap noloewdin
keywords: NOSOSCF
formula: C8H10NO5PS
InChI: InChI=1/C8H10NO5PS/c1-12-15(16,13-2)14-8-5-3-7(4-6-8)9(10)11/h3-6H,1-2H3
26 atoms
S  -1.989087 -0.242063 1.8833
P  -2.2085 -0.049396 -0.008725
O  -1.009719 0.717254 -0.789832
O  -2.302608 -1.376464 -0.879008
O  -3.460588 0.780939 -0.523849
O  4.929797 -1.098412 -0.434474
O  4.976502 0.578036 0.882575
N  4.396793 -0.176638 0.137311
C  0.311867 0.467965 -0.535202
C  0.963845 -0.541849 -1.228263
C  0.98331 1.262328 0.382418
C  2.979093 0.040984 -0.089107
C  2.31072 -0.757832 -1.005511
C  2.330752 1.051915 0.605835
C  -3.140377 -2.469969 -0.483591
C  -3.825969 2.034442 0.064963
H  0.430372 -1.146403 -1.949266
H  0.460287 2.047714 0.910685
H  2.820214 -1.540471 -1.54856
H  2.855746 1.673234 1.316769
H  -4.194009 -2.20024 -0.561262
H  -2.918741 -2.788353 0.535486
H  -2.927997 -3.286727 -1.168668
H  -4.779325 2.317899 -0.374338
H  -3.0849 2.802389 -0.160405
H  -3.9410 1.944661 1.145495
elementType: S P O N C H
totalener: -1481.40051152 hartree
nucrepener: 1396.61597394 hartree
electener: -2878.01648546 hartree
oneelecener: -4811.79855735 hartree
twoeener: 1933.78207189 hartree
cpcmener: -0.02235150 hartree
kineticenergy: 1477.01983099 hartree
xcener: -103.838388287573 hartree
chargesum: 0.0000000
charge: -0.437353 0.756761 -0.346958 -0.332863 -0.331861 -0.383449 -0.383467 0.531493 0.229305 -0.123123 -0.135230 0.054038 -0.127132 -0.117781 -0.113530 -0.110108 0.159062 0.154132 0.163578 0.164343 0.126924 0.110095 0.127642 0.130042 0.126917 0.108523
qa: -0.4374 0.7568 -0.3470 -0.3329 -0.3319 -0.3834 -0.3835 0.5315 0.2293 -0.1231 -0.1352 0.0540 -0.1271 -0.1178 -0.1135 -0.1101 0.1591 0.1541 0.1636 0.1643 0.1269 0.1101 0.1276 0.1300 0.1269 0.1085
va: 2.0026 5.5080 2.1075 2.1244 2.1132 1.8743 1.8741 4.1606 3.7988 4.0275 4.0019 3.7497 4.0560 4.0422 3.8442 3.8366 1.0038 1.0016 1.0128 1.0117 0.9866 1.0006 0.9894 0.9896 0.9866 1.0018
dispcorr: -0.010859212 hartree
energy: -1481.411370735226
dipole: -12.20509 9.41725 -2.78784 0.04928 0.30879 0.35807 -1.96578 1.03842 -0.92736
magnitude: 2.95977 au
magnitude: 7.52315 debye
